null
SMILES: COc1cc(CN2CCCC2)ccc1Nc1ncc(c(Oc2cccc3CN(C)C(=O)c23)n1)C(F)(F)F
InChI Key: InChIKey=SVZMTGLYQSIFTP-UHFFFAOYSA-N
Activity Spreadsheet -- Enzyme Inhibition Constant Data from BindingDB
Found 1 hit for monomerid = 134092
Trg + Lig
Ki
nM
ΔG°
kcal/mole
IC50
nM
Kd
nM
EC50/IC50
nM
koff
s-1
kon
M-1s-1
pHTemp
°C
Focal adhesion kinase 1
(Homo sapiens (Human))
BDBM134092
(US8846689, 94)
Show SMILES COc1cc(CN2CCCC2)ccc1Nc1ncc(c(Oc2cccc3CN(C)C(=O)c23)n1)C(F)(F)F
Show InChI InChI=1S/C26H26F3N5O3/c1-33-15-17-6-5-7-20(22(17)24(33)35)37-23-18(26(27,28)29)13-30-25(32-23)31-19-9-8-16(12-21(19)36-2)14-34-10-3-4-11-34/h5-9,12-13H,3-4,10-11,14-15H2,1-2H3,(H,30,31,32)
NCI pathway
Reactome pathway
US Patent
n/an/a 1n/an/an/an/a7.5n/a
Boehringer Ingelheim International GmbH
US Patent
Assay Description
This test uses active PTK2 enzyme (Invitrogen Code PV3832) and poly-Glu-Tyr (4:1, Sigma P-0275) as the kinase substrate. The kinase activity is detec...
US Patent US8846689 (2014)
BindingDB Entry DOI: 10.7270/Q2BC3X7Z