BDBM13418 A313326 Analogue 65::N-(3-chlorophenyl)-5-cyano-2-{[(4-cyanophenyl)(1-methyl-1H-imidazol-5-yl)methoxy]methyl}benzamide
SMILES: Cn1cncc1C(OCc1ccc(cc1C(=O)Nc1cccc(Cl)c1)C#N)c1ccc(cc1)C#N
InChI Key: InChIKey=DZYGQZQTEVKSFD-UHFFFAOYSA-N
Data: 3 IC50
Activity Spreadsheet -- Enzyme Inhibition Constant Data from BindingDB
Found 3 hits for monomerid = 13418
Trg + Lig
Ki
nM
ΔG°
kcal/mole
IC50
nM
Kd
nM
EC50/IC50
nM
koff
s-1
kon
M-1s-1
pHTemp
°C
Protein farnesyltransferase/geranylgeranyltransferase type-1 subunit alpha
(Homo sapiens (Human))
BDBM13418
(A313326 Analogue 65 | N-(3-chlorophenyl)-5-cyano-2...)
Show SMILES Cn1cncc1C(OCc1ccc(cc1C(=O)Nc1cccc(Cl)c1)C#N)c1ccc(cc1)C#N
Show InChI InChI=1S/C27H20ClN5O2/c1-33-17-31-15-25(33)26(20-8-5-18(13-29)6-9-20)35-16-21-10-7-19(14-30)11-24(21)27(34)32-23-4-2-3-22(28)12-23/h2-12,15,17,26H,16H2,1H3,(H,32,34)
Reactome pathway
n/an/a 0.75n/an/an/an/an/an/a
Globe Pharmaceutical R and Abbott Laboratories
Assay Description
The in vitro activity of compounds inhibiting FTase or GGTase-I was determined by using scintillation proximity assay (SPA) technology. The assays we...
J Med Chem 47: 612-26 (2004)
Article DOI: 10.1021/jm030434f
BindingDB Entry DOI: 10.7270/Q2Z60M8D
Protein farnesyltransferase subunit beta/geranylgeranyltransferase type-1 subunit alpha
(Homo sapiens (Human))
BDBM13418
(A313326 Analogue 65 | N-(3-chlorophenyl)-5-cyano-2...)
Show SMILES Cn1cncc1C(OCc1ccc(cc1C(=O)Nc1cccc(Cl)c1)C#N)c1ccc(cc1)C#N
Show InChI InChI=1S/C27H20ClN5O2/c1-33-17-31-15-25(33)26(20-8-5-18(13-29)6-9-20)35-16-21-10-7-19(14-30)11-24(21)27(34)32-23-4-2-3-22(28)12-23/h2-12,15,17,26H,16H2,1H3,(H,32,34)
Reactome pathway
n/an/a 759n/an/an/an/an/an/a
The M.S. University of Baroda
Curated by ChEMBL
Assay Description
Inhibition of FTase
Bioorg Med Chem Lett 16: 1821-7 (2006)
Article DOI: 10.1016/j.bmcl.2006.01.019
BindingDB Entry DOI: 10.7270/Q2W66PJG
Geranylgeranyl transferase type-1 subunit beta
(Bos taurus (bovine))
BDBM13418
(A313326 Analogue 65 | N-(3-chlorophenyl)-5-cyano-2...)
Show SMILES Cn1cncc1C(OCc1ccc(cc1C(=O)Nc1cccc(Cl)c1)C#N)c1ccc(cc1)C#N
Show InChI InChI=1S/C27H20ClN5O2/c1-33-17-31-15-25(33)26(20-8-5-18(13-29)6-9-20)35-16-21-10-7-19(14-30)11-24(21)27(34)32-23-4-2-3-22(28)12-23/h2-12,15,17,26H,16H2,1H3,(H,32,34)
n/an/a 5.70E+3n/an/an/an/an/an/a
Globe Pharmaceutical R and Abbott Laboratories
Assay Description
The in vitro activity of compounds inhibiting FTase or GGTase-I was determined by using scintillation proximity assay (SPA) technology. The assays we...
J Med Chem 47: 612-26 (2004)
Article DOI: 10.1021/jm030434f
BindingDB Entry DOI: 10.7270/Q2Z60M8D