BDBM134191 US8846689, 193
SMILES: CN1Cc2cccc(Oc3nc(Nc4ccc(cc4C)C(=O)NC4CCN(C)CC4)ncc3C(F)(F)F)c2C1=O
InChI Key: InChIKey=ZIZWEURKTNQLCZ-UHFFFAOYSA-N
Data: 1 IC50
Activity Spreadsheet -- Enzyme Inhibition Constant Data from BindingDB
Found 1 hit for monomerid = 134191
Trg + Lig
Ki
nM
ΔG°
kcal/mole
IC50
nM
Kd
nM
EC50/IC50
nM
koff
s-1
kon
M-1s-1
pHTemp
°C
Focal adhesion kinase 1
(Homo sapiens (Human))
BDBM134191
(US8846689, 193)
Show SMILES CN1Cc2cccc(Oc3nc(Nc4ccc(cc4C)C(=O)NC4CCN(C)CC4)ncc3C(F)(F)F)c2C1=O
Show InChI InChI=1S/C28H29F3N6O3/c1-16-13-17(24(38)33-19-9-11-36(2)12-10-19)7-8-21(16)34-27-32-14-20(28(29,30)31)25(35-27)40-22-6-4-5-18-15-37(3)26(39)23(18)22/h4-8,13-14,19H,9-12,15H2,1-3H3,(H,33,38)(H,32,34,35)
NCI pathway
Reactome pathway
US Patent
n/an/a 1n/an/an/an/a7.5n/a
Boehringer Ingelheim International GmbH
US Patent
Assay Description
This test uses active PTK2 enzyme (Invitrogen Code PV3832) and poly-Glu-Tyr (4:1, Sigma P-0275) as the kinase substrate. The kinase activity is detec...
US Patent US8846689 (2014)
BindingDB Entry DOI: 10.7270/Q2BC3X7Z