null
SMILES: CC(C)c1ccc(C)c(c1)N1CCc2nc(nc(N3C[C@H](C)N(CC(N)=O)C[C@H]3C)c2C1)-c1c(C)cccc1C
InChI Key: InChIKey=RXERXSOXXLKIKJ-LOSJGSFVSA-N
Activity Spreadsheet -- Enzyme Inhibition Constant Data from BindingDB
Found 1 hit for monomerid = 134544
Trg + Lig
Ki
nM
ΔG°
kcal/mole
IC50
nM
Kd
nM
EC50/IC50
nM
koff
s-1
kon
M-1s-1
pHTemp
°C
C5a anaphylatoxin chemotactic receptor 1
(Homo sapiens (Human))
BDBM134544
(US8846656, 28-B)
Show SMILES CC(C)c1ccc(C)c(c1)N1CCc2nc(nc(N3C[C@H](C)N(CC(N)=O)C[C@H]3C)c2C1)-c1c(C)cccc1C |r|
Show InChI InChI=1S/C33H44N6O/c1-20(2)26-12-11-21(3)29(15-26)37-14-13-28-27(18-37)33(36-32(35-28)31-22(4)9-8-10-23(31)5)39-17-24(6)38(16-25(39)7)19-30(34)40/h8-12,15,20,24-25H,13-14,16-19H2,1-7H3,(H2,34,40)/t24-,25+/m0/s1
US Patent
n/an/a 3n/an/an/an/an/an/a
Novartis AG
US Patent
Assay Description
Compounds were tested for their ability to inhibit C5a-mediated calcium mobilization using a stable cell line over expressing the human C5aR & the Ga...
US Patent US8846656 (2014)
BindingDB Entry DOI: 10.7270/Q2JW8CKR