BDBM134562 US8846656, 41-G
SMILES: CC(C)c1ccc(C)c(c1)N1CCc2nc(cc(C)c2C1)-c1c(ccc2[nH]ncc12)C(C)C
InChI Key: InChIKey=AHVSJFJUIINJCC-UHFFFAOYSA-N
Data: 1 IC50
Activity Spreadsheet -- Enzyme Inhibition Constant Data from BindingDB
Found 1 hit for monomerid = 134562
Trg + Lig
Ki
nM
ΔG°
kcal/mole
IC50
nM
Kd
nM
EC50/IC50
nM
koff
s-1
kon
M-1s-1
pHTemp
°C
C5a anaphylatoxin chemotactic receptor (C5aR)
(Homo sapiens (Human))
BDBM134562
(US8846656, 41-G)
Show SMILES CC(C)c1ccc(C)c(c1)N1CCc2nc(cc(C)c2C1)-c1c(ccc2[nH]ncc12)C(C)C
Show InChI InChI=1S/C29H34N4/c1-17(2)21-8-7-19(5)28(14-21)33-12-11-25-24(16-33)20(6)13-27(31-25)29-22(18(3)4)9-10-26-23(29)15-30-32-26/h7-10,13-15,17-18H,11-12,16H2,1-6H3,(H,30,32)
US Patent
n/an/a 3n/an/an/an/an/an/a
Novartis AG
US Patent
Assay Description
Compounds were tested for their ability to inhibit C5a-mediated calcium mobilization using a stable cell line over expressing the human C5aR & the Ga...
US Patent US8846656 (2014)
BindingDB Entry DOI: 10.7270/Q2JW8CKR