null
SMILES: CCc1ccnc(c1)C(=O)Nc1cncc(c1)C(=O)c1cn(C(C)C)c2ncncc12
InChI Key: InChIKey=HKCKJYKDZMYNSC-UHFFFAOYSA-N
Activity Spreadsheet -- Enzyme Inhibition Constant Data from BindingDB
Found 1 hit for monomerid = 134963
Trg + Lig
Ki
nM
ΔG°
kcal/mole
IC50
nM
Kd
nM
EC50/IC50
nM
koff
s-1
kon
M-1s-1
pHTemp
°C
High affinity nerve growth factor receptor
(Homo sapiens (Human))
BDBM134963
(US8846698, 445)
Show SMILES CCc1ccnc(c1)C(=O)Nc1cncc(c1)C(=O)c1cn(C(C)C)c2ncncc12
Show InChI InChI=1S/C23H22N6O2/c1-4-15-5-6-26-20(7-15)23(31)28-17-8-16(9-24-10-17)21(30)19-12-29(14(2)3)22-18(19)11-25-13-27-22/h5-14H,4H2,1-3H3,(H,28,31)
US Patent
n/an/a 5.51n/an/an/an/an/an/a
Pfizer Limited
US Patent
Assay Description
Isolated TRK Enzyme assays use the HTRF KinEASE-TK kit (Cisbio Cat# 62TK0PEJ) with recombinant His-tagged cytoplasmic domains of each TRK receptor so...
US Patent US8846698 (2014)
BindingDB Entry DOI: 10.7270/Q2F47MTW