null
SMILES: CC(C)(C)n1cc(C(=O)c2cncc(NC(=O)Cc3ccc(Cl)cc3)c2)c2cncnc12
InChI Key: InChIKey=DWHAOUYNAKKOJI-UHFFFAOYSA-N
Activity Spreadsheet -- Enzyme Inhibition Constant Data from BindingDB
Found 1 hit for monomerid = 135058
Trg + Lig
Ki
nM
ΔG°
kcal/mole
IC50
nM
Kd
nM
EC50/IC50
nM
koff
s-1
kon
M-1s-1
pHTemp
°C
High affinity nerve growth factor receptor
(Homo sapiens (Human))
BDBM135058
(US8846698, 545)
Show SMILES CC(C)(C)n1cc(C(=O)c2cncc(NC(=O)Cc3ccc(Cl)cc3)c2)c2cncnc12
Show InChI InChI=1S/C24H22ClN5O2/c1-24(2,3)30-13-20(19-12-27-14-28-23(19)30)22(32)16-9-18(11-26-10-16)29-21(31)8-15-4-6-17(25)7-5-15/h4-7,9-14H,8H2,1-3H3,(H,29,31)
US Patent
n/an/a 2.95n/an/an/an/an/an/a
Pfizer Limited
US Patent
Assay Description
Isolated TRK Enzyme assays use the HTRF KinEASE-TK kit (Cisbio Cat# 62TK0PEJ) with recombinant His-tagged cytoplasmic domains of each TRK receptor so...
US Patent US8846698 (2014)
BindingDB Entry DOI: 10.7270/Q2F47MTW