null
SMILES: CC1(COC1)n1cc(C(=O)c2cncc(NC(=O)Cc3ccc(cc3)C(F)(F)F)c2)c2cncnc12
InChI Key: InChIKey=ZYGITBGVDYFJEP-UHFFFAOYSA-N
Activity Spreadsheet -- Enzyme Inhibition Constant Data from BindingDB
Found 1 hit for monomerid = 135083
Trg + Lig
Ki
nM
ΔG°
kcal/mole
IC50
nM
Kd
nM
EC50/IC50
nM
koff
s-1
kon
M-1s-1
pHTemp
°C
High affinity nerve growth factor receptor
(Homo sapiens (Human))
BDBM135083
(US8846698, 571)
Show SMILES CC1(COC1)n1cc(C(=O)c2cncc(NC(=O)Cc3ccc(cc3)C(F)(F)F)c2)c2cncnc12
Show InChI InChI=1S/C25H20F3N5O3/c1-24(12-36-13-24)33-11-20(19-10-30-14-31-23(19)33)22(35)16-7-18(9-29-8-16)32-21(34)6-15-2-4-17(5-3-15)25(26,27)28/h2-5,7-11,14H,6,12-13H2,1H3,(H,32,34)
US Patent
n/an/a 2.92n/an/an/an/an/an/a
Pfizer Limited
US Patent
Assay Description
Isolated TRK Enzyme assays use the HTRF KinEASE-TK kit (Cisbio Cat# 62TK0PEJ) with recombinant His-tagged cytoplasmic domains of each TRK receptor so...
US Patent US8846698 (2014)
BindingDB Entry DOI: 10.7270/Q2F47MTW