null
SMILES: O=C1N2CCSC2(c2ccccc12)c1ccccc1
InChI Key: InChIKey=CTGFADZNCCTVMP-UHFFFAOYSA-N
PDB links: 2 PDB IDs contain this monomer as substructures. 2 PDB IDs contain inhibitors having a similarity of 90% to this monomer.
Activity Spreadsheet -- Enzyme Inhibition Constant Data from BindingDB
Found 2 hits for monomerid = 1354
Trg + Lig
Ki
nM
ΔG°
kcal/mole
IC50
nM
Kd
nM
EC50/IC50
nM
koff
s-1
kon
M-1s-1
pHTemp
°C
Reverse transcriptase/RNaseH
(Human immunodeficiency virus 1)
BDBM1354
(9-Phenyl-2,3-Dihydrothiazola[2,3-a]isoindol-5(9bH)...)
Show SMILES O=C1N2CCSC2(c2ccccc12)c1ccccc1
Show InChI InChI=1S/C16H13NOS/c18-15-13-8-4-5-9-14(13)16(17(15)10-11-19-16)12-6-2-1-3-7-12/h1-9H,10-11H2
n/an/a 280n/an/an/an/an/an/a
Boehringer Mannheim GmbH
Curated by ChEMBL
Assay Description
In vitro for inhibitory activity against HIV-1 Reverse Transcriptase
J Med Chem 36: 726-32 (1993)
BindingDB Entry DOI: 10.7270/Q2ZG6R9J
Gag-Pol polyprotein [588-1027]/[588-1147]
(Human immunodeficiency virus type 1)
BDBM1354
(9-Phenyl-2,3-Dihydrothiazola[2,3-a]isoindol-5(9bH)...)
Show SMILES O=C1N2CCSC2(c2ccccc12)c1ccccc1
Show InChI InChI=1S/C16H13NOS/c18-15-13-8-4-5-9-14(13)16(17(15)10-11-19-16)12-6-2-1-3-7-12/h1-9H,10-11H2
n/an/a 700n/an/an/an/a7.737
Boehringer Mannheim GmbH
Assay Description
The IC50 of reverse transcriptase is the concentration that inhibits 50% of recombinant HIV-1 RT RNA-directed DNA polymerase activity in vitro.
J Med Chem 36: 2526-35 (1993)
Article DOI: 10.1021/jm00069a011
BindingDB Entry DOI: 10.7270/Q2BR8QCZ