BDBM13567 2-[(4-carbamimidoylphenyl)amino]-2-{3-ethynyl-5-[(3S)-oxolan-3-yloxy]phenyl}acetic acid::phenylglycine deriv. 15
SMILES: NC(=N)c1ccc(NC(C(O)=O)c2cc(O[C@H]3CCOC3)cc(c2)C#C)cc1
InChI Key: InChIKey=VMITUNZSHSJLHI-KKFHFHRHSA-N
Data: 4 KI
Activity Spreadsheet -- Enzyme Inhibition Constant Data from BindingDB
Found 4 hits for monomerid = 13567
Trg + Lig
Ki
nM
ΔG°
kcal/mole
IC50
nM
Kd
nM
EC50/IC50
nM
koff
s-1
kon
M-1s-1
pHTemp
°C
Coagulation factor VII
(Homo sapiens (Human))
BDBM13567
(2-[(4-carbamimidoylphenyl)amino]-2-{3-ethynyl-5-[(...)
Show SMILES NC(=N)c1ccc(NC(C(O)=O)c2cc(O[C@H]3CCOC3)cc(c2)C#C)cc1 |r|
Show InChI InChI=1S/C21H21N3O4/c1-2-13-9-15(11-18(10-13)28-17-7-8-27-12-17)19(21(25)26)24-16-5-3-14(4-6-16)20(22)23/h1,3-6,9-11,17,19,24H,7-8,12H2,(H3,22,23)(H,25,26)/t17-,19?/m0/s1
Reactome pathway
65 -9.70n/an/an/an/an/a7.822
F. Hoffmann-La Roche Ltd.
Assay Description
The enzyme reactions were initiated by the addition of substrate, and the color developed from the release of p-nitroanilide from each chromogenic su...
Bioorg Med Chem Lett 15: 5344-52 (2005)
Article DOI: 10.1016/j.bmcl.2005.04.079
BindingDB Entry DOI: 10.7270/Q2X63K6X
Coagulation factor X
(Homo sapiens (Human))
BDBM13567
(2-[(4-carbamimidoylphenyl)amino]-2-{3-ethynyl-5-[(...)
Show SMILES NC(=N)c1ccc(NC(C(O)=O)c2cc(O[C@H]3CCOC3)cc(c2)C#C)cc1 |r|
Show InChI InChI=1S/C21H21N3O4/c1-2-13-9-15(11-18(10-13)28-17-7-8-27-12-17)19(21(25)26)24-16-5-3-14(4-6-16)20(22)23/h1,3-6,9-11,17,19,24H,7-8,12H2,(H3,22,23)(H,25,26)/t17-,19?/m0/s1
Reactome pathway
2.60E+3n/an/an/an/an/an/an/an/a
F. Hoffmann-La Roche Ltd.
Assay Description
The enzyme reactions were initiated by the addition of substrate, and the color developed from the release of p-nitroanilide from each chromogenic su...
Bioorg Med Chem Lett 15: 5344-52 (2005)
Article DOI: 10.1016/j.bmcl.2005.04.079
BindingDB Entry DOI: 10.7270/Q2X63K6X
Trypsin
(Bos taurus (bovine))
BDBM13567
(2-[(4-carbamimidoylphenyl)amino]-2-{3-ethynyl-5-[(...)
Show SMILES NC(=N)c1ccc(NC(C(O)=O)c2cc(O[C@H]3CCOC3)cc(c2)C#C)cc1 |r|
Show InChI InChI=1S/C21H21N3O4/c1-2-13-9-15(11-18(10-13)28-17-7-8-27-12-17)19(21(25)26)24-16-5-3-14(4-6-16)20(22)23/h1,3-6,9-11,17,19,24H,7-8,12H2,(H3,22,23)(H,25,26)/t17-,19?/m0/s1
5.40E+3n/an/an/an/an/an/an/an/a
F. Hoffmann-La Roche Ltd.
Assay Description
The enzyme reactions were initiated by the addition of substrate, and the color developed from the release of p-nitroanilide from each chromogenic su...
Bioorg Med Chem Lett 15: 5344-52 (2005)
Article DOI: 10.1016/j.bmcl.2005.04.079
BindingDB Entry DOI: 10.7270/Q2X63K6X
Prothrombin
(Homo sapiens (Human))
BDBM13567
(2-[(4-carbamimidoylphenyl)amino]-2-{3-ethynyl-5-[(...)
Show SMILES NC(=N)c1ccc(NC(C(O)=O)c2cc(O[C@H]3CCOC3)cc(c2)C#C)cc1 |r|
Show InChI InChI=1S/C21H21N3O4/c1-2-13-9-15(11-18(10-13)28-17-7-8-27-12-17)19(21(25)26)24-16-5-3-14(4-6-16)20(22)23/h1,3-6,9-11,17,19,24H,7-8,12H2,(H3,22,23)(H,25,26)/t17-,19?/m0/s1
9.50E+3n/an/an/an/an/an/an/an/a
F. Hoffmann-La Roche Ltd.
Assay Description
The enzyme reactions were initiated by the addition of substrate, and the color developed from the release of p-nitroanilide from each chromogenic su...
Bioorg Med Chem Lett 15: 5344-52 (2005)
Article DOI: 10.1016/j.bmcl.2005.04.079
BindingDB Entry DOI: 10.7270/Q2X63K6X