BDBM135725 US10179804, Example 110::US10632171, Peptide No. 110::US8846601, 110::US9458201, 110
SMILES: CC(=O)N[C@@H](CCCNC(N)=N)C(=O)N[C@H]1CCC(=O)NCCC[C@H](NC(=O)[C@H](Cc2c[nH]c3ccccc23)NC(=O)[C@H](CCCNC(N)=N)NC(=O)[C@@H](Cc2ccccc2)NC(=O)[C@H](Cc2c[nH]cn2)NC1=O)C(=O)NC1CC1
InChI Key:
Data: 4 KI
Activity Spreadsheet -- Enzyme Inhibition Constant Data from BindingDB
Found 4 hits for monomerid = 135725
Trg + Lig
Ki
nM
ΔG°
kcal/mole
IC50
nM
Kd
nM
EC50/IC50
nM
koff
s-1
kon
M-1s-1
pHTemp
°C
Melanocortin receptor 4
(Homo sapiens (Human))
BDBM135725
(US10179804, Example 110 | US10632171, Peptide No. ...)
Show SMILES CC(=O)N[C@@H](CCCNC(N)=N)C(=O)N[C@H]1CCC(=O)NCCC[C@H](NC(=O)[C@H](Cc2c[nH]c3ccccc23)NC(=O)[C@H](CCCNC(N)=N)NC(=O)[C@@H](Cc2ccccc2)NC(=O)[C@H](Cc2c[nH]cn2)NC1=O)C(=O)NC1CC1 |r|
US Patent
1n/an/an/an/an/an/a7.5n/a
Palatin Technologies, Inc.
US Patent
Assay Description
A competitive inhibition binding assay is performed using membrane homogenates prepared from HEK-293 cells that express recombinant hMC4-R, hMC3-R, o...
US Patent US8846601 (2014)
BindingDB Entry DOI: 10.7270/Q2SF2TWK
Melanocortin receptor 4
(Homo sapiens (Human))
BDBM135725
(US10179804, Example 110 | US10632171, Peptide No. ...)
Show SMILES CC(=O)N[C@@H](CCCNC(N)=N)C(=O)N[C@H]1CCC(=O)NCCC[C@H](NC(=O)[C@H](Cc2c[nH]c3ccccc23)NC(=O)[C@H](CCCNC(N)=N)NC(=O)[C@@H](Cc2ccccc2)NC(=O)[C@H](Cc2c[nH]cn2)NC1=O)C(=O)NC1CC1 |r|
US Patent
1n/an/an/an/an/an/an/an/a
Palatin Technologies, Inc.
US Patent
Assay Description
A competitive inhibition binding assay is performed using membrane homogenates prepared from HEK-293 cells that express recombinant hMC4-R, hMC3-R, o...
US Patent US10632171 (2020)
Melanocortin receptor 4
(Homo sapiens (Human))
BDBM135725
(US10179804, Example 110 | US10632171, Peptide No. ...)
Show SMILES CC(=O)N[C@@H](CCCNC(N)=N)C(=O)N[C@H]1CCC(=O)NCCC[C@H](NC(=O)[C@H](Cc2c[nH]c3ccccc23)NC(=O)[C@H](CCCNC(N)=N)NC(=O)[C@@H](Cc2ccccc2)NC(=O)[C@H](Cc2c[nH]cn2)NC1=O)C(=O)NC1CC1 |r|
US Patent
1n/an/an/an/an/an/an/an/a
Palatin Technologies, Inc.
US Patent
Assay Description
Accumulation of intracellular cAMP was examined as a measure of the ability of the peptides of the present invention to elicit a functional response ...
US Patent US10179804 (2019)
BindingDB Entry DOI: 10.7270/Q24T6MFP
Melanocortin receptor 4
(Homo sapiens (Human))
BDBM135725
(US10179804, Example 110 | US10632171, Peptide No. ...)
Show SMILES CC(=O)N[C@@H](CCCNC(N)=N)C(=O)N[C@H]1CCC(=O)NCCC[C@H](NC(=O)[C@H](Cc2c[nH]c3ccccc23)NC(=O)[C@H](CCCNC(N)=N)NC(=O)[C@@H](Cc2ccccc2)NC(=O)[C@H](Cc2c[nH]cn2)NC1=O)C(=O)NC1CC1 |r|
US Patent
1 -12.8n/an/an/an/an/an/a37
Palatin Technologies, Inc.
US Patent
Assay Description
A competitive inhibition binding assay was performed employing Eu-NDP-α-MSH (PerkinElmer Life Sciences catalog No. AD0225) with determination b...
US Patent US9458201 (2016)
BindingDB Entry DOI: 10.7270/Q2HT2N79