BDBM135783 US8853242, 148
SMILES: NC(N)=NC(=O)c1ccc2c(F)cnc(-c3c(F)cccc3F)c2c1
InChI Key: InChIKey=NPYWVXJXMOTDHT-UHFFFAOYSA-N
Data: 1 KI
Activity Spreadsheet -- Enzyme Inhibition Constant Data from BindingDB
Found 1 hit for monomerid = 135783
Trg + Lig
Ki
nM
ΔG°
kcal/mole
IC50
nM
Kd
nM
EC50/IC50
nM
koff
s-1
kon
M-1s-1
pHTemp
°C
5-hydroxytryptamine receptor 5A
(Homo sapiens (Human))
BDBM135783
(US8853242, 148)
Show SMILES NC(N)=NC(=O)c1ccc2c(F)cnc(-c3c(F)cccc3F)c2c1 |(6,-.77,;4.67,,;4.67,1.54,;3.33,-.77,;2,,;2,1.54,;.67,-.77,;.67,-2.31,;-.67,-3.08,;-2,-2.31,;-3.33,-3.08,;-3.33,-4.62,;-4.67,-2.31,;-4.67,-.77,;-3.33,,;-3.33,1.54,;-4.67,2.31,;-6,1.54,;-4.67,3.85,;-3.33,4.62,;-2,3.85,;-2,2.31,;-.67,1.54,;-2,-.77,;-.67,,)|
Show InChI InChI=1S/C17H11F3N4O/c18-11-2-1-3-12(19)14(11)15-10-6-8(16(25)24-17(21)22)4-5-9(10)13(20)7-23-15/h1-7H,(H4,21,22,24,25)
US Patent
1.40 -12.1n/an/an/an/an/a7.525
Astellas Pharma Inc.
US Patent
Assay Description
A solution of the compound to be tested and 100 μM 5-CT (5-carboxamidetriptamine) in DMSO was added to a 96-well plate at 2 μl/well, suspen...
US Patent US8853242 (2014)
BindingDB Entry DOI: 10.7270/Q2NP2346