BDBM135784 US8853242, 151
SMILES: [#7]\[#6](-[#7])=[#7]\[#6](=O)-c1ccc2c(F)cnc(-c3ccc(F)cc3Cl)c2c1
InChI Key: InChIKey=CRRMCGPQPIPQCJ-UHFFFAOYSA-N
Data: 1 KI
Activity Spreadsheet -- Enzyme Inhibition Constant Data from BindingDB
Found 1 hit for monomerid = 135784
Trg + Lig
Ki
nM
ΔG°
kcal/mole
IC50
nM
Kd
nM
EC50/IC50
nM
koff
s-1
kon
M-1s-1
pHTemp
°C
5-hydroxytryptamine receptor 5A
(Homo sapiens (Human))
BDBM135784
(US8853242, 151)
Show SMILES [#7]\[#6](-[#7])=[#7]\[#6](=O)-c1ccc2c(F)cnc(-c3ccc(F)cc3Cl)c2c1
Show InChI InChI=1S/C17H11ClF2N4O/c18-13-6-9(19)2-4-11(13)15-12-5-8(16(25)24-17(21)22)1-3-10(12)14(20)7-23-15/h1-7H,(H4,21,22,24,25)
US Patent
4.10 -11.4n/an/an/an/an/a7.525
Astellas Pharma Inc.
US Patent
Assay Description
A solution of the compound to be tested and 100 μM 5-CT (5-carboxamidetriptamine) in DMSO was added to a 96-well plate at 2 μl/well, suspen...
US Patent US8853242 (2014)
BindingDB Entry DOI: 10.7270/Q2NP2346