BDBM13590 (2R)-2-[(4-carbamimidoylphenyl)amino]-2-{5-ethoxy-2-fluoro-3-[(3R)-oxolan-3-yloxy]phenyl}acetic acid::(R)-(4-Carbamimidoyl-phenylamino)-{3-ethoxy-2-fluoro-5-[(R)-(tetra-hydro-furan-3-yl)-oxy]-phenyl}-acetic acid::phenylglycine derivative 5
SMILES: CCOc1cc(O[C@@H]2CCOC2)c(F)c(c1)[C@@H](Nc1ccc(cc1)C(N)=N)C(O)=O
InChI Key: InChIKey=PGYOHIAQCFZQDK-AUUYWEPGSA-N
Data: 4 KI
PDB links: 1 PDB ID matches this monomer.
Activity Spreadsheet -- Enzyme Inhibition Constant Data from BindingDB
Found 4 hits for monomerid = 13590
Trg + Lig
Ki
nM
ΔG°
kcal/mole
IC50
nM
Kd
nM
EC50/IC50
nM
koff
s-1
kon
M-1s-1
pHTemp
°C
Coagulation factor VII
(Homo sapiens (Human))
BDBM13590
((2R)-2-[(4-carbamimidoylphenyl)amino]-2-{5-ethoxy-...)
Show SMILES CCOc1cc(O[C@@H]2CCOC2)c(F)c(c1)[C@@H](Nc1ccc(cc1)C(N)=N)C(O)=O |r|
Show InChI InChI=1S/C21H24FN3O5/c1-2-29-15-9-16(18(22)17(10-15)30-14-7-8-28-11-14)19(21(26)27)25-13-5-3-12(4-6-13)20(23)24/h3-6,9-10,14,19,25H,2,7-8,11H2,1H3,(H3,23,24)(H,26,27)/t14-,19-/m1/s1
Reactome pathway
81 -9.57n/an/an/an/an/a7.822
F. Hoffmann-La Roche Ltd.
Assay Description
The enzyme reactions were initiated by the addition of substrate, and the color developed from the release of p-nitroanilide from each chromogenic su...
Bioorg Med Chem 14: 5357-69 (2006)
Article DOI: 10.1016/j.bmc.2006.03.042
BindingDB Entry DOI: 10.7270/Q2NP22PZ
3D
3D Structure (crystal)
Coagulation factor X
(Homo sapiens (Human))
BDBM13590
((2R)-2-[(4-carbamimidoylphenyl)amino]-2-{5-ethoxy-...)
Show SMILES CCOc1cc(O[C@@H]2CCOC2)c(F)c(c1)[C@@H](Nc1ccc(cc1)C(N)=N)C(O)=O |r|
Show InChI InChI=1S/C21H24FN3O5/c1-2-29-15-9-16(18(22)17(10-15)30-14-7-8-28-11-14)19(21(26)27)25-13-5-3-12(4-6-13)20(23)24/h3-6,9-10,14,19,25H,2,7-8,11H2,1H3,(H3,23,24)(H,26,27)/t14-,19-/m1/s1
Reactome pathway
1.90E+3n/an/an/an/an/an/an/an/a
F. Hoffmann-La Roche Ltd.
Assay Description
The enzyme reactions were initiated by the addition of substrate, and the color developed from the release of p-nitroanilide from each chromogenic su...
Bioorg Med Chem 14: 5357-69 (2006)
Article DOI: 10.1016/j.bmc.2006.03.042
BindingDB Entry DOI: 10.7270/Q2NP22PZ
Trypsin
(Bos taurus (bovine))
BDBM13590
((2R)-2-[(4-carbamimidoylphenyl)amino]-2-{5-ethoxy-...)
Show SMILES CCOc1cc(O[C@@H]2CCOC2)c(F)c(c1)[C@@H](Nc1ccc(cc1)C(N)=N)C(O)=O |r|
Show InChI InChI=1S/C21H24FN3O5/c1-2-29-15-9-16(18(22)17(10-15)30-14-7-8-28-11-14)19(21(26)27)25-13-5-3-12(4-6-13)20(23)24/h3-6,9-10,14,19,25H,2,7-8,11H2,1H3,(H3,23,24)(H,26,27)/t14-,19-/m1/s1
3.20E+3n/an/an/an/an/an/an/an/a
F. Hoffmann-La Roche Ltd.
Assay Description
The enzyme reactions were initiated by the addition of substrate, and the color developed from the release of p-nitroanilide from each chromogenic su...
Bioorg Med Chem 14: 5357-69 (2006)
Article DOI: 10.1016/j.bmc.2006.03.042
BindingDB Entry DOI: 10.7270/Q2NP22PZ
Prothrombin
(Homo sapiens (Human))
BDBM13590
((2R)-2-[(4-carbamimidoylphenyl)amino]-2-{5-ethoxy-...)
Show SMILES CCOc1cc(O[C@@H]2CCOC2)c(F)c(c1)[C@@H](Nc1ccc(cc1)C(N)=N)C(O)=O |r|
Show InChI InChI=1S/C21H24FN3O5/c1-2-29-15-9-16(18(22)17(10-15)30-14-7-8-28-11-14)19(21(26)27)25-13-5-3-12(4-6-13)20(23)24/h3-6,9-10,14,19,25H,2,7-8,11H2,1H3,(H3,23,24)(H,26,27)/t14-,19-/m1/s1
4.50E+3 -7.22n/an/an/an/an/a7.822
F. Hoffmann-La Roche Ltd.
Assay Description
The enzyme reactions were initiated by the addition of substrate, and the color developed from the release of p-nitroanilide from each chromogenic su...
Bioorg Med Chem 14: 5357-69 (2006)
Article DOI: 10.1016/j.bmc.2006.03.042
BindingDB Entry DOI: 10.7270/Q2NP22PZ