BDBM135911 US8859596, 200
SMILES: CCCCn1n(C)c(c\c1=N/C(=O)c1cc(ccc1NNC(=O)c1ccncc1)C(F)(F)F)C(C)(C)C
InChI Key: InChIKey=KLWISKKFHVSWFI-DFKUXCBWSA-N
Data: 2 KI
Activity Spreadsheet -- Enzyme Inhibition Constant Data from BindingDB
Found 2 hits for monomerid = 135911
Trg + Lig
Ki
nM
ΔG°
kcal/mole
IC50
nM
Kd
nM
EC50/IC50
nM
koff
s-1
kon
M-1s-1
pHTemp
°C
Cannabinoid receptor 2
(Homo sapiens (Human))
BDBM135911
(US8859596, 200)
Show SMILES CCCCn1n(C)c(c\c1=N/C(=O)c1cc(ccc1NNC(=O)c1ccncc1)C(F)(F)F)C(C)(C)C
Show InChI InChI=1S/C26H31F3N6O2/c1-6-7-14-35-22(16-21(34(35)5)25(2,3)4)31-24(37)19-15-18(26(27,28)29)8-9-20(19)32-33-23(36)17-10-12-30-13-11-17/h8-13,15-16,32H,6-7,14H2,1-5H3,(H,33,36)/b31-22+
Reactome pathway
US Patent
0.700 -12.7n/an/an/an/an/a7.430
AbbVie Inc.
US Patent
Assay Description
HEK293 cells stably expressing human CB2 receptors were grown until a confluent monolayer was formed. Briefly, the cells were harvested and homogeniz...
US Patent US8859596 (2014)
BindingDB Entry DOI: 10.7270/Q2W66JHC
Cannabinoid receptor 2
(Rattus norvegicus (Rat))
BDBM135911
(US8859596, 200)
Show SMILES CCCCn1n(C)c(c\c1=N/C(=O)c1cc(ccc1NNC(=O)c1ccncc1)C(F)(F)F)C(C)(C)C
Show InChI InChI=1S/C26H31F3N6O2/c1-6-7-14-35-22(16-21(34(35)5)25(2,3)4)31-24(37)19-15-18(26(27,28)29)8-9-20(19)32-33-23(36)17-10-12-30-13-11-17/h8-13,15-16,32H,6-7,14H2,1-5H3,(H,33,36)/b31-22+
US Patent
1.30n/an/an/an/an/an/a7.4n/a
AbbVie Inc.
US Patent
Assay Description
HEK293 cells stably expressing rat CB2 receptors were grown until a confluent monolayer was formed. Briefly, the cells were harvested and homogenized...
US Patent US8859596 (2014)
BindingDB Entry DOI: 10.7270/Q2W66JHC