null
SMILES: CCCCCNC(=O)[C@H](Cc1ccc(OCC(O)=O)c(c1)C(O)=O)NC(=O)[C@H](Cc1ccccc1)NC(=O)Cn1[nH]ncc1=S
InChI Key: InChIKey=RLCZXIOSOGAOMZ-GOTSBHOMSA-N
Activity Spreadsheet -- Enzyme Inhibition Constant Data from BindingDB
Found 1 hit for monomerid = 13614
Trg + Lig
Ki
nM
ΔG°
kcal/mole
IC50
nM
Kd
nM
EC50/IC50
nM
koff
s-1
kon
M-1s-1
pHTemp
°C
Tyrosine-protein phosphatase non-receptor type 1
(Rattus norvegicus (rat))
BDBM13614
(2-(carboxymethoxy)-5-[(2S)-2-(pentylcarbamoyl)-2-[...)
Show SMILES CCCCCNC(=O)[C@H](Cc1ccc(OCC(O)=O)c(c1)C(O)=O)NC(=O)[C@H](Cc1ccccc1)NC(=O)Cn1[nH]ncc1=S |r|
Show InChI InChI=1S/C30H36N6O8S/c1-2-3-7-12-31-28(40)22(15-20-10-11-24(44-18-27(38)39)21(13-20)30(42)43)34-29(41)23(14-19-8-5-4-6-9-19)33-25(37)17-36-26(45)16-32-35-36/h4-6,8-11,13,16,22-23,35H,2-3,7,12,14-15,17-18H2,1H3,(H,31,40)(H,33,37)(H,34,41)(H,38,39)(H,42,43)/t22-,23-/m0/s1
Reactome pathway
120 -9.34n/an/an/an/an/a7.222
Pharmacia Corporation
Assay Description
Hydrolysis of substrate p-nitrophenyl phosphate was monitored on a 96-well microplate reader. Concentrations of PTP1B inhibitors that resulted in 50%...
Biochemistry 40: 5642-54 (2001)
Article DOI: 10.1021/bi002865v
BindingDB Entry DOI: 10.7270/Q2D50K6S