BDBM13619 3-Oxybenzamide 5::3-[2-(4-bromophenyl)ethoxy]-4-chloro-N-{[1-(pyridin-4-yl)piperidin-4-yl]methyl}benzamide
SMILES: Clc1ccc(cc1OCCc1ccc(Br)cc1)C(=O)NCC1CCN(CC1)c1ccncc1
InChI Key: InChIKey=MNIIBNMCMGLNIR-UHFFFAOYSA-N
Data: 4 KI
Activity Spreadsheet -- Enzyme Inhibition Constant Data from BindingDB
Found 4 hits for monomerid = 13619
Trg + Lig
Ki
nM
ΔG°
kcal/mole
IC50
nM
Kd
nM
EC50/IC50
nM
koff
s-1
kon
M-1s-1
pHTemp
°C
Coagulation factor X
(Homo sapiens (Human))
BDBM13619
(3-Oxybenzamide 5 | 3-[2-(4-bromophenyl)ethoxy]-4-c...)
Show SMILES Clc1ccc(cc1OCCc1ccc(Br)cc1)C(=O)NCC1CCN(CC1)c1ccncc1
Show InChI InChI=1S/C26H27BrClN3O2/c27-22-4-1-19(2-5-22)11-16-33-25-17-21(3-6-24(25)28)26(32)30-18-20-9-14-31(15-10-20)23-7-12-29-13-8-23/h1-8,12-13,17,20H,9-11,14-16,18H2,(H,30,32)
Reactome pathway
36 -10.1n/an/an/an/an/a7.825
Aventis Pharma Deutschland GmbH
Assay Description
The inhibitory effect of test compound for human fXa was determined by using the chromogenic substrates S-2765. The hydrolysis rates of chromogenic s...
J Med Chem 48: 3290-312 (2005)
Article DOI: 10.1021/jm049187l
BindingDB Entry DOI: 10.7270/Q28C9THZ
Coagulation factor X
(Homo sapiens (Human))
BDBM13619
(3-Oxybenzamide 5 | 3-[2-(4-bromophenyl)ethoxy]-4-c...)
Show SMILES Clc1ccc(cc1OCCc1ccc(Br)cc1)C(=O)NCC1CCN(CC1)c1ccncc1
Show InChI InChI=1S/C26H27BrClN3O2/c27-22-4-1-19(2-5-22)11-16-33-25-17-21(3-6-24(25)28)26(32)30-18-20-9-14-31(15-10-20)23-7-12-29-13-8-23/h1-8,12-13,17,20H,9-11,14-16,18H2,(H,30,32)
Reactome pathway
36n/an/an/an/an/an/an/an/a
Aventis Pharma Deutschland GmbH
Curated by ChEMBL
Assay Description
Inhibitory activity against human Coagulation factor X
Bioorg Med Chem Lett 14: 2801-5 (2004)
Article DOI: 10.1016/j.bmcl.2004.03.059
BindingDB Entry DOI: 10.7270/Q2XS5WW7
Coagulation factor X
(Homo sapiens (Human))
BDBM13619
(3-Oxybenzamide 5 | 3-[2-(4-bromophenyl)ethoxy]-4-c...)
Show SMILES Clc1ccc(cc1OCCc1ccc(Br)cc1)C(=O)NCC1CCN(CC1)c1ccncc1
Show InChI InChI=1S/C26H27BrClN3O2/c27-22-4-1-19(2-5-22)11-16-33-25-17-21(3-6-24(25)28)26(32)30-18-20-9-14-31(15-10-20)23-7-12-29-13-8-23/h1-8,12-13,17,20H,9-11,14-16,18H2,(H,30,32)
Reactome pathway
39.8n/an/an/an/an/an/an/an/a
Rheinische Friedrich-Wilhelms-Universita£t
Curated by ChEMBL
Assay Description
Inhibition of human factor 10a
J Med Chem 54: 2944-51 (2011)
Article DOI: 10.1021/jm200026b
BindingDB Entry DOI: 10.7270/Q2ZG6TGM
Prothrombin
(Homo sapiens (Human))
BDBM13619
(3-Oxybenzamide 5 | 3-[2-(4-bromophenyl)ethoxy]-4-c...)
Show SMILES Clc1ccc(cc1OCCc1ccc(Br)cc1)C(=O)NCC1CCN(CC1)c1ccncc1
Show InChI InChI=1S/C26H27BrClN3O2/c27-22-4-1-19(2-5-22)11-16-33-25-17-21(3-6-24(25)28)26(32)30-18-20-9-14-31(15-10-20)23-7-12-29-13-8-23/h1-8,12-13,17,20H,9-11,14-16,18H2,(H,30,32)
4.73E+3 -7.26n/an/an/an/an/a7.825
Aventis Pharma Deutschland GmbH
Assay Description
The inhibitory effect of test compound for human thrombin was determined by using the chromogenic substrates S-2366. The hydrolysis rates of chromoge...
J Med Chem 48: 3290-312 (2005)
Article DOI: 10.1021/jm049187l
BindingDB Entry DOI: 10.7270/Q28C9THZ