BDBM136323 US8859534, 9
SMILES: O=C(NCc1ccc(cc1)C#N)c1cc2cccc(N3CCN(CCc4ccccn4)CC3)c2o1
InChI Key: InChIKey=VRJKPPUSDZXOLR-UHFFFAOYSA-N
Data: 2 KI
Activity Spreadsheet -- Enzyme Inhibition Constant Data from BindingDB
Found 2 hits for monomerid = 136323
Trg + Lig
Ki
nM
ΔG°
kcal/mole
IC50
nM
Kd
nM
EC50/IC50
nM
koff
s-1
kon
M-1s-1
pHTemp
°C
5-hydroxytryptamine receptor 1A (5HT1A)
(Cricetulus griseus (Chinese hamster) (Cricetulus b...)
BDBM136323
(US8859534, 9)
Show SMILES O=C(NCc1ccc(cc1)C#N)c1cc2cccc(N3CCN(CCc4ccccn4)CC3)c2o1
Show InChI InChI=1S/C28H27N5O2/c29-19-21-7-9-22(10-8-21)20-31-28(34)26-18-23-4-3-6-25(27(23)35-26)33-16-14-32(15-17-33)13-11-24-5-1-2-12-30-24/h1-10,12,18H,11,13-17,20H2,(H,31,34)
US Patent
0.440n/an/an/an/an/an/a7.4n/a
Acturum Life Science AB
US Patent
Assay Description
Assays that were used to measure affinity of the compounds of the present invention for 5-HT1A and 5-HT1B receptors are described in J. Recept Signal...
US Patent US8859534 (2014)
BindingDB Entry DOI: 10.7270/Q23R0RKV
5-hydroxytryptamine receptor 1B (5HT1B)
(Cricetulus griseus (Chinese hamster) (Cricetulus b...)
BDBM136323
(US8859534, 9)
Show SMILES O=C(NCc1ccc(cc1)C#N)c1cc2cccc(N3CCN(CCc4ccccn4)CC3)c2o1
Show InChI InChI=1S/C28H27N5O2/c29-19-21-7-9-22(10-8-21)20-31-28(34)26-18-23-4-3-6-25(27(23)35-26)33-16-14-32(15-17-33)13-11-24-5-1-2-12-30-24/h1-10,12,18H,11,13-17,20H2,(H,31,34)
US Patent
1.80n/an/an/an/an/an/a7.4n/a
Acturum Life Science AB
US Patent
Assay Description
Assays that were used to measure affinity of the compounds of the present invention for 5-HT1A and 5-HT1B receptors are described in J. Recept Signal...
US Patent US8859534 (2014)
BindingDB Entry DOI: 10.7270/Q23R0RKV