BDBM136330 US8859534, 16
SMILES: O=C(N1CCCC1)c1cc2cccc(N3CCN(CCc4ccccn4)CC3)c2o1
InChI Key: InChIKey=ZXSHOERJJDKLRL-UHFFFAOYSA-N
Data: 2 KI
Activity Spreadsheet -- Enzyme Inhibition Constant Data from BindingDB
Found 2 hits for monomerid = 136330
Trg + Lig
Ki
nM
ΔG°
kcal/mole
IC50
nM
Kd
nM
EC50/IC50
nM
koff
s-1
kon
M-1s-1
pHTemp
°C
5-hydroxytryptamine receptor 1A (5HT1A)
(Cricetulus griseus (Chinese hamster) (Cricetulus b...)
BDBM136330
(US8859534, 16)
Show SMILES O=C(N1CCCC1)c1cc2cccc(N3CCN(CCc4ccccn4)CC3)c2o1
Show InChI InChI=1S/C24H28N4O2/c29-24(28-11-3-4-12-28)22-18-19-6-5-8-21(23(19)30-22)27-16-14-26(15-17-27)13-9-20-7-1-2-10-25-20/h1-2,5-8,10,18H,3-4,9,11-17H2
US Patent
0.780n/an/an/an/an/an/a7.4n/a
Acturum Life Science AB
US Patent
Assay Description
Assays that were used to measure affinity of the compounds of the present invention for 5-HT1A and 5-HT1B receptors are described in J. Recept Signal...
US Patent US8859534 (2014)
BindingDB Entry DOI: 10.7270/Q23R0RKV
5-hydroxytryptamine receptor 1B (5HT1B)
(Cricetulus griseus (Chinese hamster) (Cricetulus b...)
BDBM136330
(US8859534, 16)
Show SMILES O=C(N1CCCC1)c1cc2cccc(N3CCN(CCc4ccccn4)CC3)c2o1
Show InChI InChI=1S/C24H28N4O2/c29-24(28-11-3-4-12-28)22-18-19-6-5-8-21(23(19)30-22)27-16-14-26(15-17-27)13-9-20-7-1-2-10-25-20/h1-2,5-8,10,18H,3-4,9,11-17H2
US Patent
4.40n/an/an/an/an/an/a7.4n/a
Acturum Life Science AB
US Patent
Assay Description
Assays that were used to measure affinity of the compounds of the present invention for 5-HT1A and 5-HT1B receptors are described in J. Recept Signal...
US Patent US8859534 (2014)
BindingDB Entry DOI: 10.7270/Q23R0RKV