null
SMILES: Fc1cc(ccc1-c1nc[nH]n1)-c1cnn2ccc(nc12)N1[C@@H](CC2CC2)COC1=O
InChI Key:
Activity Spreadsheet -- Enzyme Inhibition Constant Data from BindingDB
Found 1 hit for monomerid = 136449
Trg + Lig
Ki
nM
ΔG°
kcal/mole
IC50
nM
Kd
nM
EC50/IC50
nM
koff
s-1
kon
M-1s-1
pHTemp
°C
Serine/threonine-protein kinase mTOR
(Homo sapiens (Human))
BDBM136449
(US8865726, 80)
Show SMILES Fc1cc(ccc1-c1nc[nH]n1)-c1cnn2ccc(nc12)N1[C@@H](CC2CC2)COC1=O |r|
NCI pathway
Reactome pathway
US Patent
n/an/a 2.30n/an/an/an/a7.522
Array BioPharma Inc.
US Patent
Assay Description
The ability of compounds of Formula I to inhibit mTOR was determined in a radioactive filtration assay that measures the transfer of radiolabeled pho...
US Patent US8865726 (2014)
BindingDB Entry DOI: 10.7270/Q2V69H93