BDBM136733 US8865911, 20a Isomer 1
SMILES: COC1CC[C@]2(Cc3ccc(cc3[C@@]22N=C(C)C(N)=N2)-c2cncc(c2)C#CC)CC1
InChI Key: InChIKey=WKDNQONLGXOZRG-DDZRMCBLSA-N
Data: 1 IC50
Activity Spreadsheet -- Enzyme Inhibition Constant Data from BindingDB
Found 1 hit for monomerid = 136733
Trg + Lig
Ki
nM
ΔG°
kcal/mole
IC50
nM
Kd
nM
EC50/IC50
nM
koff
s-1
kon
M-1s-1
pHTemp
°C
Beta-secretase 1
(Homo sapiens (Human))
BDBM136733
(US8865911, 20a Isomer 1)
Show SMILES COC1CC[C@]2(Cc3ccc(cc3[C@@]22N=C(C)C(N)=N2)-c2cncc(c2)C#CC)CC1 |r,wU:13.15,wD:5.5,c:20,t:16,(9.21,-3.04,;8.44,-1.7,;6.9,-1.7,;6.13,-3.04,;4.59,-3.04,;3.82,-1.7,;2.92,-2.95,;1.45,-2.47,;.12,-3.24,;-1.21,-2.47,;-1.21,-.93,;.12,-.16,;1.45,-.93,;2.92,-.46,;1.67,.45,;2.15,1.91,;1.38,3.24,;3.69,1.91,;4.46,3.24,;4.16,.45,;-2.55,-.16,;-2.55,1.38,;-3.88,2.15,;-5.21,1.38,;-5.21,-.16,;-3.88,-.93,;-6.55,-.93,;-7.88,-1.7,;-9.21,-2.47,;4.59,-.37,;6.13,-.37,)|
Show InChI InChI=1S/C26H28N4O/c1-4-5-18-12-21(16-28-15-18)19-6-7-20-14-25(10-8-22(31-3)9-11-25)26(23(20)13-19)29-17(2)24(27)30-26/h6-7,12-13,15-16,22H,8-11,14H2,1-3H3,(H2,27,30)/t22?,25-,26-/m0/s1
US Patent
n/an/a 0.570n/an/an/an/a9.2n/a
Astrazeneca AB
US Patent
Assay Description
TR-FRET AssayThe beta-secretase enzyme used in the TR-FRET is prepared as follows: The cDNA for the soluble part of the human beta-Secretase (AA 1-AA...
US Patent US8865911 (2014)
BindingDB Entry DOI: 10.7270/Q2T72G4T