BDBM136855 US10231967, Example 92-Isomer-2::US8865911, 289::US8865911, 92 Isomer 1::US9918985, Example 92 Isomer 2
SMILES: CO[C@H]1CC[C@@]2(Cc3ccc(cc3[C@@]22N=C(C)C(N)=N2)-c2cc(OC)cc(c2)C#N)CC1
InChI Key: InChIKey=SKNSXIIPICYXKY-MZBJOSPHSA-N
Data: 3 IC50
Activity Spreadsheet -- Enzyme Inhibition Constant Data from BindingDB
Found 3 hits for monomerid = 136855
Trg + Lig
Ki
nM
ΔG°
kcal/mole
IC50
nM
Kd
nM
EC50/IC50
nM
koff
s-1
kon
M-1s-1
pHTemp
°C
Beta-secretase 1
(Homo sapiens (Human))
BDBM136855
(US10231967, Example 92-Isomer-2 | US8865911, 289 |...)
Show SMILES CO[C@H]1CC[C@@]2(Cc3ccc(cc3[C@@]22N=C(C)C(N)=N2)-c2cc(OC)cc(c2)C#N)CC1 |r,wU:13.15,wD:5.5,2.1,c:20,t:16,(8.55,-1.36,;7.78,-2.7,;6.24,-2.7,;5.47,-1.36,;3.93,-1.36,;3.16,-2.7,;2.25,-3.94,;.79,-3.47,;-.55,-4.23,;-1.88,-3.47,;-1.88,-1.93,;-.55,-1.16,;.79,-1.93,;2.25,-1.45,;1.01,-.54,;1.48,.92,;.71,2.25,;3.02,.92,;3.79,2.25,;3.5,-.54,;-3.21,-1.16,;-4.55,-1.93,;-5.88,-1.16,;-7.21,-1.92,;-8.55,-1.15,;-5.88,.38,;-4.55,1.15,;-3.21,.38,;-4.55,2.69,;-4.55,4.23,;3.93,-4.03,;5.47,-4.03,)|
Show InChI InChI=1S/C26H28N4O2/c1-16-24(28)30-26(29-16)23-13-18(20-10-17(15-27)11-22(12-20)32-3)4-5-19(23)14-25(26)8-6-21(31-2)7-9-25/h4-5,10-13,21H,6-9,14H2,1-3H3,(H2,28,30)/t21-,25-,26-/m0/s1
US Patent
n/an/a 0.840n/an/an/an/a9.2n/a
Astrazeneca AB
US Patent
Assay Description
TR-FRET AssayThe beta-secretase enzyme used in the TR-FRET is prepared as follows: The cDNA for the soluble part of the human beta-Secretase (AA 1-AA...
US Patent US8865911 (2014)
BindingDB Entry DOI: 10.7270/Q2T72G4T
Beta-secretase 1 (aa 1-460)
(Homo sapiens (Human))
BDBM136855
(US10231967, Example 92-Isomer-2 | US8865911, 289 |...)
Show SMILES CO[C@H]1CC[C@@]2(Cc3ccc(cc3[C@@]22N=C(C)C(N)=N2)-c2cc(OC)cc(c2)C#N)CC1 |r,wU:13.15,wD:5.5,2.1,c:20,t:16,(8.55,-1.36,;7.78,-2.7,;6.24,-2.7,;5.47,-1.36,;3.93,-1.36,;3.16,-2.7,;2.25,-3.94,;.79,-3.47,;-.55,-4.23,;-1.88,-3.47,;-1.88,-1.93,;-.55,-1.16,;.79,-1.93,;2.25,-1.45,;1.01,-.54,;1.48,.92,;.71,2.25,;3.02,.92,;3.79,2.25,;3.5,-.54,;-3.21,-1.16,;-4.55,-1.93,;-5.88,-1.16,;-7.21,-1.92,;-8.55,-1.15,;-5.88,.38,;-4.55,1.15,;-3.21,.38,;-4.55,2.69,;-4.55,4.23,;3.93,-4.03,;5.47,-4.03,)|
Show InChI InChI=1S/C26H28N4O2/c1-16-24(28)30-26(29-16)23-13-18(20-10-17(15-27)11-22(12-20)32-3)4-5-19(23)14-25(26)8-6-21(31-2)7-9-25/h4-5,10-13,21H,6-9,14H2,1-3H3,(H2,28,30)/t21-,25-,26-/m0/s1
US Patent
n/an/a 5.87E+3n/an/an/an/an/an/a
University of Tennessee Health Science Center
Assay Description
The enzyme (truncated form) was diluted to 6 μg/mL (stock 1.3 mg/mL) and the substrate (Europium)CEVNLDAEFK(Qsy7) to 200 nM (stock 120 μM) ...
J Med Chem 50: 3906-20 (2007)
BindingDB Entry DOI: 10.7270/Q2CR5WP7
Beta-Secretase (AA 1-460)
(Homo sapiens (Human))
BDBM136855
(US10231967, Example 92-Isomer-2 | US8865911, 289 |...)
Show SMILES CO[C@H]1CC[C@@]2(Cc3ccc(cc3[C@@]22N=C(C)C(N)=N2)-c2cc(OC)cc(c2)C#N)CC1 |r,wU:13.15,wD:5.5,2.1,c:20,t:16,(8.55,-1.36,;7.78,-2.7,;6.24,-2.7,;5.47,-1.36,;3.93,-1.36,;3.16,-2.7,;2.25,-3.94,;.79,-3.47,;-.55,-4.23,;-1.88,-3.47,;-1.88,-1.93,;-.55,-1.16,;.79,-1.93,;2.25,-1.45,;1.01,-.54,;1.48,.92,;.71,2.25,;3.02,.92,;3.79,2.25,;3.5,-.54,;-3.21,-1.16,;-4.55,-1.93,;-5.88,-1.16,;-7.21,-1.92,;-8.55,-1.15,;-5.88,.38,;-4.55,1.15,;-3.21,.38,;-4.55,2.69,;-4.55,4.23,;3.93,-4.03,;5.47,-4.03,)|
Show InChI InChI=1S/C26H28N4O2/c1-16-24(28)30-26(29-16)23-13-18(20-10-17(15-27)11-22(12-20)32-3)4-5-19(23)14-25(26)8-6-21(31-2)7-9-25/h4-5,10-13,21H,6-9,14H2,1-3H3,(H2,28,30)/t21-,25-,26-/m0/s1
Reactome pathway
US Patent
n/an/a 5.87E+3n/an/an/an/an/an/a
Universita degli Studi di Bari
Assay Description
The β-secretase enzyme used in the TR-FRET is prepared as follows: The cDNA for the soluble part of the human β-Secretase (AA 1-AA 460) was...
J Med Chem 50: 4214-21 (2007)
BindingDB Entry DOI: 10.7270/Q2RF5X91