BDBM138128 US8871783, 14
SMILES: CC(=O)c1ccc(s1)-c1ccc(C[C@H](NC(=O)[C@H]2N[C@@H]3CC[C@H]2C3)C#N)s1
InChI Key: InChIKey=JZAUVZHRNFQAMR-LJPSSGMGSA-N
Data: 1 KI
Activity Spreadsheet -- Enzyme Inhibition Constant Data from BindingDB
Found 1 hit for monomerid = 138128
Trg + Lig
Ki
nM
ΔG°
kcal/mole
IC50
nM
Kd
nM
EC50/IC50
nM
koff
s-1
kon
M-1s-1
pHTemp
°C
Dipeptidyl peptidase I
(Homo sapiens (Human))
BDBM138128
(US8871783, 14)
Show SMILES CC(=O)c1ccc(s1)-c1ccc(C[C@H](NC(=O)[C@H]2N[C@@H]3CC[C@H]2C3)C#N)s1 |r|
Show InChI InChI=1S/C20H21N3O2S2/c1-11(24)16-6-7-18(27-16)17-5-4-15(26-17)9-14(10-21)23-20(25)19-12-2-3-13(8-12)22-19/h4-7,12-14,19,22H,2-3,8-9H2,1H3,(H,23,25)/t12-,13+,14-,19-/m0/s1
US Patent
13.4 -10.7n/an/an/an/an/a6.025
Boehringer Ingelheim International GmBh
US Patent
Assay Description
The following buffers were used: MES buffer: 25 mM MES, 50 mM NaCl, 5 mM DTT, adjusted to pH 6.0, containing 0.1% BSA; TAGZyme Buffer: 20 mM NaH2PO4,...
US Patent US8871783 (2014)
BindingDB Entry DOI: 10.7270/Q2F18XF1