BDBM138354 US8877944, 105
SMILES: NC(=O)c1cc(F)cc2CN(C3CCN(CC3)C3CCC(Cl)(Cl)CC3)C(=O)c12
InChI Key: InChIKey=CXTSPYBVOJLLFL-UHFFFAOYSA-N
Data: 2 IC50  2 Kd
Activity Spreadsheet -- Enzyme Inhibition Constant Data from BindingDB
Found 4 hits for monomerid = 138354
Trg + Lig
Ki
nM
ΔG°
kcal/mole
IC50
nM
Kd
nM
EC50/IC50
nM
koff
s-1
kon
M-1s-1
pHTemp
°C
Poly [ADP-ribose] polymerase 1 (Parp1)
(Mus musculus)
BDBM138354
(US8877944, 105)
Show SMILES NC(=O)c1cc(F)cc2CN(C3CCN(CC3)C3CCC(Cl)(Cl)CC3)C(=O)c12
Show InChI InChI=1S/C20H24Cl2FN3O2/c21-20(22)5-1-14(2-6-20)25-7-3-15(4-8-25)26-11-12-9-13(23)10-16(18(24)27)17(12)19(26)28/h9-10,14-15H,1-8,11H2,(H2,24,27)
US Patent
n/an/an/a<10n/an/an/an/an/a
Nerviano Medical Sciences S.R.L.
US Patent
Assay Description
The assay is based on the use of a probe of formula (IP) that binds to the NAD binding pocket and takes advantage of the significant change in the po...
US Patent US8877944 (2014)
BindingDB Entry DOI: 10.7270/Q2NG4PBM
Poly [ADP-ribose] polymerase 1
(Homo sapiens (Human))
BDBM138354
(US8877944, 105)
Show SMILES NC(=O)c1cc(F)cc2CN(C3CCN(CC3)C3CCC(Cl)(Cl)CC3)C(=O)c12
Show InChI InChI=1S/C20H24Cl2FN3O2/c21-20(22)5-1-14(2-6-20)25-7-3-15(4-8-25)26-11-12-9-13(23)10-16(18(24)27)17(12)19(26)28/h9-10,14-15H,1-8,11H2,(H2,24,27)
n/an/an/a<30n/an/an/an/an/a
Nerviano Medical Sciences Srl
Curated by ChEMBL
Assay Description
Binding affinity to full length recombinant human PARP-1 by fluorescence polarization displacement assay
J Med Chem 58: 6875-98 (2015)
BindingDB Entry DOI: 10.7270/Q2JD4ZKF
Poly [ADP-ribose] polymerase 1
(Homo sapiens (Human))
BDBM138354
(US8877944, 105)
Show SMILES NC(=O)c1cc(F)cc2CN(C3CCN(CC3)C3CCC(Cl)(Cl)CC3)C(=O)c12
Show InChI InChI=1S/C20H24Cl2FN3O2/c21-20(22)5-1-14(2-6-20)25-7-3-15(4-8-25)26-11-12-9-13(23)10-16(18(24)27)17(12)19(26)28/h9-10,14-15H,1-8,11H2,(H2,24,27)
n/an/a 90n/an/an/an/an/an/a
Nerviano Medical Sciences Srl
Curated by ChEMBL
Assay Description
Inhibition of PARP1 in human HeLa cells assessed as reduction of H2O2-induced PAR formation preincubated for 30 mins followed by H2O2 addition measur...
J Med Chem 58: 6875-98 (2015)
BindingDB Entry DOI: 10.7270/Q2JD4ZKF
Poly [ADP-ribose] polymerase 1 (Parp1)
(Mus musculus)
BDBM138354
(US8877944, 105)
Show SMILES NC(=O)c1cc(F)cc2CN(C3CCN(CC3)C3CCC(Cl)(Cl)CC3)C(=O)c12
Show InChI InChI=1S/C20H24Cl2FN3O2/c21-20(22)5-1-14(2-6-20)25-7-3-15(4-8-25)26-11-12-9-13(23)10-16(18(24)27)17(12)19(26)28/h9-10,14-15H,1-8,11H2,(H2,24,27)
US Patent
n/an/a 80n/an/an/an/an/an/a
Nerviano Medical Sciences S.R.L.
US Patent
Assay Description
Affinity evaluation of the tested compounds and their selectivity with respect to the different PARP isoforms of interest was assessed in a displacem...
US Patent US8877944 (2014)
BindingDB Entry DOI: 10.7270/Q2NG4PBM