BDBM139037 US8884017, 78
SMILES: Fc1cccc2sc(cc12)C(=O)N[C@H]1CN2CCC1CC2
InChI Key: InChIKey=PWCRRSMABBWGCK-ZDUSSCGKSA-N
Data: 1 KI
Activity Spreadsheet -- Enzyme Inhibition Constant Data from BindingDB
Found 1 hit for monomerid = 139037
Trg + Lig
Ki
nM
ΔG°
kcal/mole
IC50
nM
Kd
nM
EC50/IC50
nM
koff
s-1
kon
M-1s-1
pHTemp
°C
Neuronal acetylcholine receptor protein alpha-7 subunit
(Homo sapiens (Human))
BDBM139037
(US8884017, 78)
Show SMILES Fc1cccc2sc(cc12)C(=O)N[C@H]1CN2CCC1CC2 |r,wU:13.14,(2.63,3.8,;3.4,2.47,;4.94,2.47,;5.71,1.13,;4.94,-.2,;3.4,-.2,;2.37,-1.35,;.96,-.72,;1.12,.81,;2.63,1.13,;-.37,-1.49,;-.37,-3.03,;-1.71,-.72,;-3.04,-1.49,;-3.04,-3.03,;-4.37,-3.8,;-5.71,-3.03,;-5.71,-1.49,;-4.37,-.72,;-3.6,-2.05,;-5.09,-2.45,)|
Show InChI InChI=1S/C16H17FN2OS/c17-12-2-1-3-14-11(12)8-15(21-14)16(20)18-13-9-19-6-4-10(13)5-7-19/h1-3,8,10,13H,4-7,9H2,(H,18,20)/t13-/m0/s1
US Patent
80 -8.99n/an/an/an/an/a7.44
Bayer Intellectual Property GmbH
US Patent
Assay Description
The [3H]-methyllycaconitine binding assay is a modification of the method described by Davies et al. in Neuropharmacol. 1999, 38, 679-690.Rat brain t...
US Patent US8884017 (2014)
BindingDB Entry DOI: 10.7270/Q2MK6BK3