BDBM139049 US8883784, 10
SMILES: [O-][N+](=O)c1cc(ccc1N[C@H](CCN1CCOCC1)CSc1ccccc1)S(=O)(=O)NC(=O)c1csc(n1)N1CCc2cccc(C(=O)Nc3nc4ccccc4s3)c2C1
InChI Key: InChIKey=LCRLAKQIEIMENB-MUUNZHRXSA-N
Data: 1 KI
Activity Spreadsheet -- Enzyme Inhibition Constant Data from BindingDB
Found 1 hit for monomerid = 139049
Trg + Lig
Ki
nM
ΔG°
kcal/mole
IC50
nM
Kd
nM
EC50/IC50
nM
koff
s-1
kon
M-1s-1
pHTemp
°C
Bcl-2-like protein 1
(Homo sapiens (Human))
BDBM139049
(US8883784, 10)
Show SMILES [O-][N+](=O)c1cc(ccc1N[C@H](CCN1CCOCC1)CSc1ccccc1)S(=O)(=O)NC(=O)c1csc(n1)N1CCc2cccc(C(=O)Nc3nc4ccccc4s3)c2C1
Show InChI InChI=1S/C41H40N8O7S4/c50-38(45-40-43-34-11-4-5-12-37(34)59-40)31-10-6-7-27-15-18-48(24-32(27)31)41-44-35(26-58-41)39(51)46-60(54,55)30-13-14-33(36(23-30)49(52)53)42-28(16-17-47-19-21-56-22-20-47)25-57-29-8-2-1-3-9-29/h1-14,23,26,28,42H,15-22,24-25H2,(H,46,51)(H,43,45,50)/t28-/m1/s1
NCI pathway
Reactome pathway
US Patent
0.140 -13.4n/an/an/an/an/an/a25
AbbVie Inc.
US Patent
Assay Description
The measurement of competition of compounds of Formula (I) with F-Bak for a Bcl-2 family protein (Bcl-xL) binding site using a Time Resolved Fluoresc...
US Patent US8883784 (2014)
BindingDB Entry DOI: 10.7270/Q2GT5KWT