null
SMILES: CCc1c(cn2ncnc(Nc3ccc4n(Cc5ccccc5)ncc4c3)c12)C(=O)OCCCn1ccnc1
InChI Key: InChIKey=CQTPFJKIPFEALQ-UHFFFAOYSA-N
Activity Spreadsheet -- Enzyme Inhibition Constant Data from BindingDB
Found 5 hits for monomerid = 13922
Trg + Lig
Ki
nM
ΔG°
kcal/mole
IC50
nM
Kd
nM
EC50/IC50
nM
koff
s-1
kon
M-1s-1
pHTemp
°C
Receptor tyrosine-protein kinase erbB-2
(Homo sapiens (Human))
BDBM13922
(3-(1H-imidazol-1-yl)propyl 4-[(1-benzyl-1H-indazol...)
Show SMILES CCc1c(cn2ncnc(Nc3ccc4n(Cc5ccccc5)ncc4c3)c12)C(=O)OCCCn1ccnc1
Show InChI InChI=1S/C29H28N8O2/c1-2-24-25(29(38)39-14-6-12-35-13-11-30-20-35)18-37-27(24)28(31-19-33-37)34-23-9-10-26-22(15-23)16-32-36(26)17-21-7-4-3-5-8-21/h3-5,7-11,13,15-16,18-20H,2,6,12,14,17H2,1H3,(H,31,33,34)
n/an/a 240n/an/an/an/an/an/a
Bristol-Myers Squibb Pharmaceutical Research Institute
Curated by ChEMBL
Assay Description
The kinase activity was determined by using recombinant enzyme incubating with its substrate in the presence of test compound and ATP/[gamma-33P] ATP...
Bioorg Med Chem Lett 15: 4774-9 (2005)
Article DOI: 10.1016/j.bmcl.2005.07.027
BindingDB Entry DOI: 10.7270/Q2XD1172
Epidermal growth factor receptor
(Homo sapiens (Human))
BDBM13922
(3-(1H-imidazol-1-yl)propyl 4-[(1-benzyl-1H-indazol...)
Show SMILES CCc1c(cn2ncnc(Nc3ccc4n(Cc5ccccc5)ncc4c3)c12)C(=O)OCCCn1ccnc1
Show InChI InChI=1S/C29H28N8O2/c1-2-24-25(29(38)39-14-6-12-35-13-11-30-20-35)18-37-27(24)28(31-19-33-37)34-23-9-10-26-22(15-23)16-32-36(26)17-21-7-4-3-5-8-21/h3-5,7-11,13,15-16,18-20H,2,6,12,14,17H2,1H3,(H,31,33,34)
n/an/a 170n/an/an/an/an/an/a
Bristol-Myers Squibb Pharmaceutical Research Institute
Curated by ChEMBL
Assay Description
The kinase activity was determined by using recombinant enzyme incubating with its substrate in the presence of test compound and ATP/[gamma-33P] ATP...
Bioorg Med Chem Lett 15: 4774-9 (2005)
Article DOI: 10.1016/j.bmcl.2005.07.027
BindingDB Entry DOI: 10.7270/Q2XD1172
Epidermal growth factor receptor
(Homo sapiens (Human))
BDBM13922
(3-(1H-imidazol-1-yl)propyl 4-[(1-benzyl-1H-indazol...)
Show SMILES CCc1c(cn2ncnc(Nc3ccc4n(Cc5ccccc5)ncc4c3)c12)C(=O)OCCCn1ccnc1
Show InChI InChI=1S/C29H28N8O2/c1-2-24-25(29(38)39-14-6-12-35-13-11-30-20-35)18-37-27(24)28(31-19-33-37)34-23-9-10-26-22(15-23)16-32-36(26)17-21-7-4-3-5-8-21/h3-5,7-11,13,15-16,18-20H,2,6,12,14,17H2,1H3,(H,31,33,34)
n/an/a 170n/an/an/an/an/an/a
Bristol-Myers Squibb Pharmaceutical Research Institute
Curated by ChEMBL
Assay Description
In vitro inhibitory concentration against EGFR cytoplasmic sequence expressed in Sf9 cells
Bioorg Med Chem Lett 15: 4774-9 (2005)
Article DOI: 10.1016/j.bmcl.2005.07.027
BindingDB Entry DOI: 10.7270/Q2XD1172
Receptor tyrosine-protein kinase erbB-2
(Homo sapiens (Human))
BDBM13922
(3-(1H-imidazol-1-yl)propyl 4-[(1-benzyl-1H-indazol...)
Show SMILES CCc1c(cn2ncnc(Nc3ccc4n(Cc5ccccc5)ncc4c3)c12)C(=O)OCCCn1ccnc1
Show InChI InChI=1S/C29H28N8O2/c1-2-24-25(29(38)39-14-6-12-35-13-11-30-20-35)18-37-27(24)28(31-19-33-37)34-23-9-10-26-22(15-23)16-32-36(26)17-21-7-4-3-5-8-21/h3-5,7-11,13,15-16,18-20H,2,6,12,14,17H2,1H3,(H,31,33,34)
n/an/a 240n/an/an/an/an/an/a
Bristol-Myers Squibb Pharmaceutical Research Institute
Curated by ChEMBL
Assay Description
In vitro inhibitory concentration against HER2 cytoplasmic sequence expressed in Sf9 cells
Bioorg Med Chem Lett 15: 4774-9 (2005)
Article DOI: 10.1016/j.bmcl.2005.07.027
BindingDB Entry DOI: 10.7270/Q2XD1172
Receptor tyrosine-protein kinase erbB-2
(Homo sapiens (Human))
BDBM13922
(3-(1H-imidazol-1-yl)propyl 4-[(1-benzyl-1H-indazol...)
Show SMILES CCc1c(cn2ncnc(Nc3ccc4n(Cc5ccccc5)ncc4c3)c12)C(=O)OCCCn1ccnc1
Show InChI InChI=1S/C29H28N8O2/c1-2-24-25(29(38)39-14-6-12-35-13-11-30-20-35)18-37-27(24)28(31-19-33-37)34-23-9-10-26-22(15-23)16-32-36(26)17-21-7-4-3-5-8-21/h3-5,7-11,13,15-16,18-20H,2,6,12,14,17H2,1H3,(H,31,33,34)
n/an/a 1.60E+3n/an/an/an/an/an/a
Bristol-Myers Squibb Pharmaceutical Research Institute
Curated by ChEMBL
Assay Description
Inhibitory concentration against Sal2 (salivary gland carcinoma) cell line expressing active HER2
Bioorg Med Chem Lett 15: 4774-9 (2005)
Article DOI: 10.1016/j.bmcl.2005.07.027
BindingDB Entry DOI: 10.7270/Q2XD1172