BDBM139220 US8877733, 27
SMILES: C[C@]1(O)[C@@H](O)[C@H](COP(O)(=O)OP(O)(=O)OP(O)(O)=O)O[C@]1(C#N)n1ccc(=O)[nH]c1=O
InChI Key:
Data: 1 IC50
Activity Spreadsheet -- Enzyme Inhibition Constant Data from BindingDB
Found 1 hit for monomerid = 139220
Trg + Lig
Ki
nM
ΔG°
kcal/mole
IC50
nM
Kd
nM
EC50/IC50
nM
koff
s-1
kon
M-1s-1
pHTemp
°C
Genome polyprotein
(Hepatitis C virus (HCV))
BDBM139220
(US8877733, 27)
Show SMILES C[C@]1(O)[C@@H](O)[C@H](COP(O)(=O)OP(O)(=O)OP(O)(O)=O)O[C@]1(C#N)n1ccc(=O)[nH]c1=O |r|
US Patent
n/an/a 2.70E+4n/an/an/an/a7.535
Gilead Sciences, Inc.
US Patent
Assay Description
Assay Protocol: Either wild type or S282T (Migliaccio, et al., J. Biol. Chem. 2003, 49164-49170; Klumpp, et al., J. Biol. Chem. 2006, 3793-3799) muta...
US Patent US8877733 (2014)
BindingDB Entry DOI: 10.7270/Q2QC026F