BDBM139609 US8889870, 155::US9388176, 155::US9820989, 155
SMILES: CC(C)c1cccc(NC(=O)c2cc(C)cc(c2)N2CCc3ncncc3C2)c1
InChI Key: InChIKey=WWMPXLGXZMAACP-UHFFFAOYSA-N
Data: 1 KI  2 IC50
Activity Spreadsheet -- Enzyme Inhibition Constant Data from BindingDB
Found 3 hits for monomerid = 139609
Trg + Lig
Ki
nM
ΔG°
kcal/mole
IC50
nM
Kd
nM
EC50/IC50
nM
koff
s-1
kon
M-1s-1
pHTemp
°C
Vascular endothelial growth factor receptor 2
(Homo sapiens (Human))
BDBM139609
(US8889870, 155 | US9388176, 155 | US9820989, 155)
Show SMILES CC(C)c1cccc(NC(=O)c2cc(C)cc(c2)N2CCc3ncncc3C2)c1
Show InChI InChI=1S/C24H26N4O/c1-16(2)18-5-4-6-21(11-18)27-24(29)19-9-17(3)10-22(12-19)28-8-7-23-20(14-28)13-25-15-26-23/h4-6,9-13,15-16H,7-8,14H2,1-3H3,(H,27,29)
NCI pathway
Reactome pathway
US Patent
159n/an/an/an/an/an/an/an/a
ALLERGAN, INC.
US Patent
Assay Description
Biochemical KDR kinase assays were performed in 96 well microliter plates that were coated overnight with 75 μg/well of poly-Glu-Tyr (4:1) in 10...
US Patent US9820989 (2017)
BindingDB Entry DOI: 10.7270/Q2TT4T6G
Vascular endothelial growth factor receptor 2
(Homo sapiens (Human))
BDBM139609
(US8889870, 155 | US9388176, 155 | US9820989, 155)
Show SMILES CC(C)c1cccc(NC(=O)c2cc(C)cc(c2)N2CCc3ncncc3C2)c1
Show InChI InChI=1S/C24H26N4O/c1-16(2)18-5-4-6-21(11-18)27-24(29)19-9-17(3)10-22(12-19)28-8-7-23-20(14-28)13-25-15-26-23/h4-6,9-13,15-16H,7-8,14H2,1-3H3,(H,27,29)
NCI pathway
Reactome pathway
US Patent
n/an/a 159n/an/an/an/a7.4n/a
Allergan, Inc.
US Patent
Assay Description
Biochemical KDR kinase assays were performed in 96 well microliter plates that were coated overnight with 75 .mu.g/well of poly-Glu-Tyr (4:1) in 10 m...
US Patent US8889870 (2014)
BindingDB Entry DOI: 10.7270/Q25B0158
Vascular endothelial growth factor receptor 2
(Homo sapiens (Human))
BDBM139609
(US8889870, 155 | US9388176, 155 | US9820989, 155)
Show SMILES CC(C)c1cccc(NC(=O)c2cc(C)cc(c2)N2CCc3ncncc3C2)c1
Show InChI InChI=1S/C24H26N4O/c1-16(2)18-5-4-6-21(11-18)27-24(29)19-9-17(3)10-22(12-19)28-8-7-23-20(14-28)13-25-15-26-23/h4-6,9-13,15-16H,7-8,14H2,1-3H3,(H,27,29)
NCI pathway
Reactome pathway
US Patent
n/an/a 159n/an/an/an/a7.430
ALLERGAN, INC.
US Patent
Assay Description
Biochemical KDR kinase assays were performed in 96 well microliter plates that were coated overnight with 75 μg/well of poly-Glu-Tyr (4:1) in 10 m...
US Patent US9388176 (2016)
BindingDB Entry DOI: 10.7270/Q2TQ60DZ