null
SMILES: COc1c(OC[C@H](O)CN2CCCC2)ccc2C3=NCCN3C(NC(=O)c3cncnc3)=Nc12
InChI Key: InChIKey=RVQZMUCQNNIFCY-MRXNPFEDSA-N
Activity Spreadsheet -- Enzyme Inhibition Constant Data from BindingDB
Found 1 hit for monomerid = 139746
Trg + Lig
Ki
nM
ΔG°
kcal/mole
IC50
nM
Kd
nM
EC50/IC50
nM
koff
s-1
kon
M-1s-1
pHTemp
°C
Phosphatidylinositol 4,5-bisphosphate 3-kinase catalytic subunit beta isoform
(Homo sapiens (Human))
BDBM139746
(US8895549, 24)
Show SMILES COc1c(OC[C@H](O)CN2CCCC2)ccc2C3=NCCN3C(NC(=O)c3cncnc3)=Nc12 |r,c:34,t:18|
Show InChI InChI=1S/C23H27N7O4/c1-33-20-18(34-13-16(31)12-29-7-2-3-8-29)5-4-17-19(20)27-23(30-9-6-26-21(17)30)28-22(32)15-10-24-14-25-11-15/h4-5,10-11,14,16,31H,2-3,6-9,12-13H2,1H3,(H,27,28,32)/t16-/m1/s1
NCI pathway
Reactome pathway
US Patent
n/an/a 1.99n/an/an/an/an/an/a
Bayer Intellectual Property GmbH
US Patent
Assay Description
As reagents for the kinase reaction itself and the quantification of the reaction product, the PI3-Kinase HTRF Assay kit from Millipore (#33-017) was...
US Patent US8895549 (2014)
BindingDB Entry DOI: 10.7270/Q2NC5ZWF