null
SMILES: Cn1cnc(c1)-c1ccn2c(cnc2c1)-c1cccc(NC(=O)NCC(F)(F)F)c1
InChI Key: InChIKey=PTHZNWHNJJFJCL-UHFFFAOYSA-N
Activity Spreadsheet -- Enzyme Inhibition Constant Data from BindingDB
Found 1 hit for monomerid = 139913
Trg + Lig
Ki
nM
ΔG°
kcal/mole
IC50
nM
Kd
nM
EC50/IC50
nM
koff
s-1
kon
M-1s-1
pHTemp
°C
Fibroblast growth factor receptor 3
(Homo sapiens (Human))
BDBM139913
(US8895745, 375)
Show SMILES Cn1cnc(c1)-c1ccn2c(cnc2c1)-c1cccc(NC(=O)NCC(F)(F)F)c1
Show InChI InChI=1S/C20H17F3N6O/c1-28-10-16(26-12-28)13-5-6-29-17(9-24-18(29)8-13)14-3-2-4-15(7-14)27-19(30)25-11-20(21,22)23/h2-10,12H,11H2,1H3,(H2,25,27,30)
Reactome pathway
US Patent
n/an/a 0.490n/an/an/an/a7.5n/a
Astex Therapeutics Limited
US Patent
Assay Description
Enzymes (from Upstate) were prepared at 2x final concentration in 1x kinase assay buffer (as described below). Enzymes were then incubated with test ...
US Patent US8895745 (2014)
BindingDB Entry DOI: 10.7270/Q2833QQC