BDBM139929 US8901087, 8
SMILES: CC[C@H]1O[C@@H]2SC(NC)=N[C@@H]2[C@@H](O)[C@@H]1O
InChI Key: InChIKey=JUIIABZGDNXDCC-FMDGEEDCSA-N
Data: 1 KI
Activity Spreadsheet -- Enzyme Inhibition Constant Data from BindingDB
Found 1 hit for monomerid = 139929
Trg + Lig
Ki
nM
ΔG°
kcal/mole
IC50
nM
Kd
nM
EC50/IC50
nM
koff
s-1
kon
M-1s-1
pHTemp
°C
N-acetyl-beta-D-glucosaminidase (O-GlcNAcase)
(Homo sapiens (Human))
BDBM139929
(US8901087, 8)
Show SMILES CC[C@H]1O[C@@H]2SC(NC)=N[C@@H]2[C@@H](O)[C@@H]1O |c:8|
Show InChI InChI=1S/C9H16N2O3S/c1-3-4-6(12)7(13)5-8(14-4)15-9(10-2)11-5/h4-8,12-13H,3H2,1-2H3,(H,10,11)/t4-,5-,6-,7-,8-/m1/s1
US Patent
0.680 -12.5n/an/an/an/an/a7.025
Merck Sharp & Dohme Corp.
US Patent
Assay Description
Enzymatic reactions are carried out in a reaction containing 50 mM NaH2PO4, 100 mM NaCl and 0.1% BSA (pH 7.0) using 2 mM 4-Methylumbelliferyl N-acety...
US Patent US8901087 (2014)
BindingDB Entry DOI: 10.7270/Q24B301W