BDBM139930 US8901087, 11
SMILES: CN(C)C1=N[C@H]2[C@H](O[C@H]([C@@H](O)C(F)(F)F)[C@@H](O)[C@@H]2O)S1
InChI Key: InChIKey=BASCULYPSMJIDE-YQOPPWPCSA-N
Data: 1 KI
Activity Spreadsheet -- Enzyme Inhibition Constant Data from BindingDB
Found 1 hit for monomerid = 139930
Trg + Lig
Ki
nM
ΔG°
kcal/mole
IC50
nM
Kd
nM
EC50/IC50
nM
koff
s-1
kon
M-1s-1
pHTemp
°C
N-acetyl-beta-D-glucosaminidase (O-GlcNAcase)
(Homo sapiens (Human))
BDBM139930
(US8901087, 11)
Show SMILES CN(C)C1=N[C@H]2[C@H](O[C@H]([C@@H](O)C(F)(F)F)[C@@H](O)[C@@H]2O)S1 |t:3|
Show InChI InChI=1S/C10H15F3N2O4S/c1-15(2)9-14-3-4(16)5(17)6(19-8(3)20-9)7(18)10(11,12)13/h3-8,16-18H,1-2H3/t3-,4-,5+,6+,7-,8-/m1/s1
US Patent
0.300 -13.0n/an/an/an/an/a7.025
Merck Sharp & Dohme Corp.
US Patent
Assay Description
Enzymatic reactions are carried out in a reaction containing 50 mM NaH2PO4, 100 mM NaCl and 0.1% BSA (pH 7.0) using 2 mM 4-Methylumbelliferyl N-acety...
US Patent US8901087 (2014)
BindingDB Entry DOI: 10.7270/Q24B301W