BDBM139961 US8901087, 211
SMILES: CCN(C)C1=N[C@H]2[C@H](O[C@H]([C@@H](O)C(F)(F)F)[C@@H](O)[C@@H]2O)S1
InChI Key: InChIKey=ZWOKYUBSBOSDPY-NTXXKDEISA-N
Data: 1 KI
Activity Spreadsheet -- Enzyme Inhibition Constant Data from BindingDB
Found 1 hit for monomerid = 139961
Trg + Lig
Ki
nM
ΔG°
kcal/mole
IC50
nM
Kd
nM
EC50/IC50
nM
koff
s-1
kon
M-1s-1
pHTemp
°C
Protein O-GlcNAcase
(Homo sapiens (Human))
BDBM139961
(US8901087, 211)
Show SMILES CCN(C)C1=N[C@H]2[C@H](O[C@H]([C@@H](O)C(F)(F)F)[C@@H](O)[C@@H]2O)S1 |t:4|
Show InChI InChI=1S/C11H17F3N2O4S/c1-3-16(2)10-15-4-5(17)6(18)7(20-9(4)21-10)8(19)11(12,13)14/h4-9,17-19H,3H2,1-2H3/t4-,5-,6+,7+,8-,9-/m1/s1
US Patent
0.440 -12.8n/an/an/an/an/a7.025
Merck Sharp & Dohme Corp.
US Patent
Assay Description
Enzymatic reactions are carried out in a reaction containing 50 mM NaH2PO4, 100 mM NaCl and 0.1% BSA (pH 7.0) using 2 mM 4-Methylumbelliferyl N-acety...
US Patent US8901087 (2014)
BindingDB Entry DOI: 10.7270/Q24B301W