BDBM139999 US8901295, F557
SMILES: CN(C(=O)CNC(=O)NCc1ccc(N)cc1)c1ccccc1
InChI Key: InChIKey=KLGPLJDVBFPMKH-UHFFFAOYSA-N
Data: 1 IC50
Activity Spreadsheet -- Enzyme Inhibition Constant Data from BindingDB
Found 1 hit for monomerid = 139999
Trg + Lig
Ki
nM
ΔG°
kcal/mole
IC50
nM
Kd
nM
EC50/IC50
nM
koff
s-1
kon
M-1s-1
pHTemp
°C
Peptidyl-prolyl cis-trans isomerase B
(Homo sapiens (Human))
BDBM139999
(US8901295, F557)
Show SMILES CN(C(=O)CNC(=O)NCc1ccc(N)cc1)c1ccccc1
Show InChI InChI=1S/C17H20N4O2/c1-21(15-5-3-2-4-6-15)16(22)12-20-17(23)19-11-13-7-9-14(18)10-8-13/h2-10H,11-12,18H2,1H3,(H2,19,20,23)
Reactome pathway
US Patent
n/an/a 4.45E+4n/an/an/an/a7.820
Institut National de la Sante et de la Recherche Medicale (INSERM); Universite Montpellier 1; Universite Paris-EST Creteil val de Marne; Assistance Publique-Hopitaux de Paris; Centre National de la Recherche Scientifique
US Patent
Assay Description
Cyclophilin PPlase activity was measured at 20 C. by using the standard chymotrypsin coupled assay (Kofron J L, Kuzmic P, Kishore V, Colon-Bonilla E,...
US Patent US8901295 (2014)
BindingDB Entry DOI: 10.7270/Q2R49PGS