BDBM140050 US8901315, 72
SMILES: Cc1nn(C2CCCCC2)c2sc(cc12)C(=O)Nc1ccc(cc1)N1CCNCC1
InChI Key: InChIKey=SYILDSHBDJWPPD-UHFFFAOYSA-N
Data: 2 IC50
Activity Spreadsheet -- Enzyme Inhibition Constant Data from BindingDB
Found 2 hits for monomerid = 140050
Trg + Lig
Ki
nM
ΔG°
kcal/mole
IC50
nM
Kd
nM
EC50/IC50
nM
koff
s-1
kon
M-1s-1
pHTemp
°C
Phosphodiesterase 4 (PDE4)
(Mus musculus (Mouse))
BDBM140050
(US8901315, 72)
Show SMILES Cc1nn(C2CCCCC2)c2sc(cc12)C(=O)Nc1ccc(cc1)N1CCNCC1
Show InChI InChI=1S/C23H29N5OS/c1-16-20-15-21(30-23(20)28(26-16)19-5-3-2-4-6-19)22(29)25-17-7-9-18(10-8-17)27-13-11-24-12-14-27/h7-10,15,19,24H,2-6,11-14H2,1H3,(H,25,29)
US Patent
n/an/a 1.20E+3n/an/an/an/a6.54
Daiichi Sankyo Company, Limited
US Patent
Assay Description
The PDE 4 (phosphodiesterase IV) inhibiting effect of the compounds of the present invention was performed by the following method, which was modifie...
US Patent US8901315 (2014)
BindingDB Entry DOI: 10.7270/Q2GM860P
Phosphodiesterase 7
(Homo sapiens (Human))
BDBM140050
(US8901315, 72)
Show SMILES Cc1nn(C2CCCCC2)c2sc(cc12)C(=O)Nc1ccc(cc1)N1CCNCC1
Show InChI InChI=1S/C23H29N5OS/c1-16-20-15-21(30-23(20)28(26-16)19-5-3-2-4-6-19)22(29)25-17-7-9-18(10-8-17)27-13-11-24-12-14-27/h7-10,15,19,24H,2-6,11-14H2,1H3,(H,25,29)
Reactome pathway
US Patent
n/an/a 10n/an/an/an/a7.54
Daiichi Sankyo Company, Limited
US Patent
Assay Description
The PDE 7 (phosphodiesterase VII) inhibiting effect of the compounds of the present invention was performed by the following method, which was modifi...
US Patent US8901315 (2014)
BindingDB Entry DOI: 10.7270/Q2GM860P