null
SMILES: Cc1nn(C2CCCCC2)c2sc(cc12)C(=O)N[C@H]1CC[C@@H](CC1)N1CCC(O)CC1
InChI Key: InChIKey=MYJKENZQYMVSSC-IYARVYRRSA-N
Activity Spreadsheet -- Enzyme Inhibition Constant Data from BindingDB
Found 2 hits for monomerid = 140093
Trg + Lig
Ki
nM
ΔG°
kcal/mole
IC50
nM
Kd
nM
EC50/IC50
nM
koff
s-1
kon
M-1s-1
pHTemp
°C
Phosphodiesterase
(Mus musculus (Mouse))
BDBM140093
(US8901315, 176)
Show SMILES Cc1nn(C2CCCCC2)c2sc(cc12)C(=O)N[C@H]1CC[C@@H](CC1)N1CCC(O)CC1 |r,wU:18.20,wD:21.27,(-8.09,4.1,;-7.32,2.77,;-8.23,1.52,;-7.32,.27,;-7.72,-1.21,;-9.21,-1.61,;-9.6,-3.1,;-8.52,-4.19,;-7.03,-3.79,;-6.63,-2.3,;-5.86,.75,;-4.39,.27,;-3.49,1.52,;-4.39,2.77,;-5.86,2.29,;-1.95,1.52,;-1.18,.19,;-1.18,2.85,;.36,2.85,;1.13,4.19,;2.67,4.19,;3.44,2.85,;2.67,1.52,;1.13,1.52,;4.98,2.85,;5.75,1.52,;7.29,1.52,;8.06,2.85,;9.6,2.85,;7.29,4.19,;5.75,4.19,)|
Show InChI InChI=1S/C24H36N4O2S/c1-16-21-15-22(31-24(21)28(26-16)19-5-3-2-4-6-19)23(30)25-17-7-9-18(10-8-17)27-13-11-20(29)12-14-27/h15,17-20,29H,2-14H2,1H3,(H,25,30)/t17-,18-
US Patent
n/an/a 1.70E+3n/an/an/an/a6.54
Daiichi Sankyo Company, Limited
US Patent
Assay Description
The PDE 4 (phosphodiesterase IV) inhibiting effect of the compounds of the present invention was performed by the following method, which was modifie...
US Patent US8901315 (2014)
BindingDB Entry DOI: 10.7270/Q2GM860P
High affinity cAMP-specific 3',5'-cyclic phosphodiesterase 7A
(Homo sapiens (Human))
BDBM140093
(US8901315, 176)
Show SMILES Cc1nn(C2CCCCC2)c2sc(cc12)C(=O)N[C@H]1CC[C@@H](CC1)N1CCC(O)CC1 |r,wU:18.20,wD:21.27,(-8.09,4.1,;-7.32,2.77,;-8.23,1.52,;-7.32,.27,;-7.72,-1.21,;-9.21,-1.61,;-9.6,-3.1,;-8.52,-4.19,;-7.03,-3.79,;-6.63,-2.3,;-5.86,.75,;-4.39,.27,;-3.49,1.52,;-4.39,2.77,;-5.86,2.29,;-1.95,1.52,;-1.18,.19,;-1.18,2.85,;.36,2.85,;1.13,4.19,;2.67,4.19,;3.44,2.85,;2.67,1.52,;1.13,1.52,;4.98,2.85,;5.75,1.52,;7.29,1.52,;8.06,2.85,;9.6,2.85,;7.29,4.19,;5.75,4.19,)|
Show InChI InChI=1S/C24H36N4O2S/c1-16-21-15-22(31-24(21)28(26-16)19-5-3-2-4-6-19)23(30)25-17-7-9-18(10-8-17)27-13-11-20(29)12-14-27/h15,17-20,29H,2-14H2,1H3,(H,25,30)/t17-,18-
Reactome pathway
US Patent
n/an/a 20n/an/an/an/a7.54
Daiichi Sankyo Company, Limited
US Patent
Assay Description
The PDE 7 (phosphodiesterase VII) inhibiting effect of the compounds of the present invention was performed by the following method, which was modifi...
US Patent US8901315 (2014)
BindingDB Entry DOI: 10.7270/Q2GM860P