BDBM140315 US8912173, 41
SMILES: C[C@@H](Oc1cc(cc2ncccc12)-c1ccc2[nH]cnc2c1)[C@H]1CNC(=O)C1
InChI Key:
Data: 1 IC50
Activity Spreadsheet -- Enzyme Inhibition Constant Data from BindingDB
Found 1 hit for monomerid = 140315
Trg + Lig
Ki
nM
ΔG°
kcal/mole
IC50
nM
Kd
nM
EC50/IC50
nM
koff
s-1
kon
M-1s-1
pHTemp
°C
Tyrosine-protein kinase SYK
(Homo sapiens (Human))
BDBM140315
(US8912173, 41)
Show SMILES C[C@@H](Oc1cc(cc2ncccc12)-c1ccc2[nH]cnc2c1)[C@H]1CNC(=O)C1 |r|
NCI pathway
Reactome pathway
US Patent
n/an/a 0.300n/an/an/an/a7.5-80
Boehringer Ingelheim International GmbH
US Patent
Assay Description
Recombinant human Syk (amino acids 342-635) was expressed as a fusion protein with an N-terminal GST tag, affinity-purified and deep-frozen at a conc...
US Patent US8912173 (2014)
BindingDB Entry DOI: 10.7270/Q2TX3D3T