null
SMILES: C[C@@H](Oc1cc(cc2ncccc12)-c1ccc(nc1)N1CCOCC1)[C@H]1CNC(=O)C1
InChI Key: InChIKey=PBAIGXUJFDIADY-VQIMIIECSA-N
Activity Spreadsheet -- Enzyme Inhibition Constant Data from BindingDB
Found 1 hit for monomerid = 140322
Trg + Lig
Ki
nM
ΔG°
kcal/mole
IC50
nM
Kd
nM
EC50/IC50
nM
koff
s-1
kon
M-1s-1
pHTemp
°C
Tyrosine-protein kinase SYK
(Homo sapiens (Human))
BDBM140322
(US8912173, 48)
Show SMILES C[C@@H](Oc1cc(cc2ncccc12)-c1ccc(nc1)N1CCOCC1)[C@H]1CNC(=O)C1 |r|
Show InChI InChI=1S/C24H26N4O3/c1-16(19-13-24(29)27-15-19)31-22-12-18(11-21-20(22)3-2-6-25-21)17-4-5-23(26-14-17)28-7-9-30-10-8-28/h2-6,11-12,14,16,19H,7-10,13,15H2,1H3,(H,27,29)/t16-,19-/m1/s1
NCI pathway
Reactome pathway
US Patent
n/an/a 0.100n/an/an/an/a7.5-80
Boehringer Ingelheim International GmbH
US Patent
Assay Description
Recombinant human Syk (amino acids 342-635) was expressed as a fusion protein with an N-terminal GST tag, affinity-purified and deep-frozen at a conc...
US Patent US8912173 (2014)
BindingDB Entry DOI: 10.7270/Q2TX3D3T