BDBM14034 4-{1-ethyl-6-phenoxy-1H-imidazo[4,5-c]pyridin-2-yl}-1,2,5-oxadiazol-3-amine::Aminofurazanyl-azabenzimidazole 6b
SMILES: CCn1c(nc2cnc(Oc3ccccc3)cc12)-c1nonc1N
InChI Key: InChIKey=LTDQKANNSLPXRR-UHFFFAOYSA-N
Data: 1 IC50
Activity Spreadsheet -- Enzyme Inhibition Constant Data from BindingDB
Found 1 hit for monomerid = 14034
Trg + Lig
Ki
nM
ΔG°
kcal/mole
IC50
nM
Kd
nM
EC50/IC50
nM
koff
s-1
kon
M-1s-1
pHTemp
°C
Rho-associated protein kinase 1
(Homo sapiens (Human))
BDBM14034
(4-{1-ethyl-6-phenoxy-1H-imidazo[4,5-c]pyridin-2-yl...)
Show SMILES CCn1c(nc2cnc(Oc3ccccc3)cc12)-c1nonc1N
Show InChI InChI=1S/C16H14N6O2/c1-2-22-12-8-13(23-10-6-4-3-5-7-10)18-9-11(12)19-16(22)14-15(17)21-24-20-14/h3-9H,2H2,1H3,(H2,17,21)
NCI pathway
Reactome pathway
n/an/a 30n/an/an/an/a7.422
GlaxoSmithKline
Assay Description
The assay of Rock-1 activity involved incubation with peptide substrate and ATP/[gamma-33P] ATP, the subsequent incorporation of 33P into the peptid...
J Med Chem 50: 2-5 (2007)
Article DOI: 10.1021/jm060873p
BindingDB Entry DOI: 10.7270/Q2F18WZB