BDBM140390 US10947243, Example 115::US8912173, 115::US9914735, Example 115
SMILES: CC(C)n1cc(cn1)-c1cc(O[C@H](C)[C@H]2CNC(=O)C2)c2cccnc2c1
InChI Key: InChIKey=ISOQIZINACKWNJ-GDBMZVCRSA-N
Data: 9 IC50
Activity Spreadsheet -- Enzyme Inhibition Constant Data from BindingDB
Found 9 hits for monomerid = 140390
Trg + Lig
Ki
nM
ΔG°
kcal/mole
IC50
nM
Kd
nM
EC50/IC50
nM
koff
s-1
kon
M-1s-1
pHTemp
°C
Tyrosine-protein kinase SYK
(Homo sapiens (Human))
BDBM140390
(US10947243, Example 115 | US8912173, 115 | US99147...)
Show SMILES CC(C)n1cc(cn1)-c1cc(O[C@H](C)[C@H]2CNC(=O)C2)c2cccnc2c1 |r|
Show InChI InChI=1S/C21H24N4O2/c1-13(2)25-12-17(11-24-25)15-7-19-18(5-4-6-22-19)20(8-15)27-14(3)16-9-21(26)23-10-16/h4-8,11-14,16H,9-10H2,1-3H3,(H,23,26)/t14-,16-/m1/s1
NCI pathway
Reactome pathway
US Patent
n/an/a 0.5n/an/an/an/a7.5-80
Boehringer Ingelheim International GmbH
US Patent
Assay Description
Recombinant human Syk (amino acids 342-635) was expressed as a fusion protein with an N-terminal GST tag, affinity-purified and deep-frozen at a conc...
US Patent US8912173 (2014)
BindingDB Entry DOI: 10.7270/Q2TX3D3T
Tyrosine-protein kinase SYK
(Homo sapiens (Human))
BDBM140390
(US10947243, Example 115 | US8912173, 115 | US99147...)
Show SMILES CC(C)n1cc(cn1)-c1cc(O[C@H](C)[C@H]2CNC(=O)C2)c2cccnc2c1 |r|
Show InChI InChI=1S/C21H24N4O2/c1-13(2)25-12-17(11-24-25)15-7-19-18(5-4-6-22-19)20(8-15)27-14(3)16-9-21(26)23-10-16/h4-8,11-14,16H,9-10H2,1-3H3,(H,23,26)/t14-,16-/m1/s1
NCI pathway
Reactome pathway
US Patent
n/an/a 0.200n/an/an/an/an/an/a
University of Namur
Assay Description
Human GSK3beta (expressed and prified from SF21 cells) is obtained from the University Dundee/Scotland (Dr. James Hastie—Dept. of Biochemistry) ...
J Med Chem 51: 3077-80 (2008)
BindingDB Entry DOI: 10.7270/Q21G0PJ6
Aurora kinase B
(Homo sapiens (Human))
BDBM140390
(US10947243, Example 115 | US8912173, 115 | US99147...)
Show SMILES CC(C)n1cc(cn1)-c1cc(O[C@H](C)[C@H]2CNC(=O)C2)c2cccnc2c1 |r|
Show InChI InChI=1S/C21H24N4O2/c1-13(2)25-12-17(11-24-25)15-7-19-18(5-4-6-22-19)20(8-15)27-14(3)16-9-21(26)23-10-16/h4-8,11-14,16H,9-10H2,1-3H3,(H,23,26)/t14-,16-/m1/s1
Reactome pathway
US Patent
n/an/a 21n/an/an/an/an/an/a
University of Namur
Assay Description
Recombinant human Aurora B (amino acids 1-344, clone number DU1773, Molecular weight 40.2 kDa, University of Dundee) was expressed as a fusion protei...
J Med Chem 51: 3077-80 (2008)
BindingDB Entry DOI: 10.7270/Q21G0PJ6
Receptor-type tyrosine-protein kinase FLT3
(Homo sapiens (Human))
BDBM140390
(US10947243, Example 115 | US8912173, 115 | US99147...)
Show SMILES CC(C)n1cc(cn1)-c1cc(O[C@H](C)[C@H]2CNC(=O)C2)c2cccnc2c1 |r|
Show InChI InChI=1S/C21H24N4O2/c1-13(2)25-12-17(11-24-25)15-7-19-18(5-4-6-22-19)20(8-15)27-14(3)16-9-21(26)23-10-16/h4-8,11-14,16H,9-10H2,1-3H3,(H,23,26)/t14-,16-/m1/s1
US Patent
n/an/a 41n/an/an/an/an/an/a
University of Namur
Assay Description
FLT3 is obtained from Invitrogen in 50 mM Tris (pH7.5); 100 mM NaCl; 0.05 mM EDTA, 0.05% NP-40, 2 mM DTT; 50% Glycerol # PV3182; Lot 286671; sequence...
J Med Chem 51: 3077-80 (2008)
BindingDB Entry DOI: 10.7270/Q21G0PJ6
Glycogen synthase kinase-3 beta
(Homo sapiens (Human))
BDBM140390
(US10947243, Example 115 | US8912173, 115 | US99147...)
Show SMILES CC(C)n1cc(cn1)-c1cc(O[C@H](C)[C@H]2CNC(=O)C2)c2cccnc2c1 |r|
Show InChI InChI=1S/C21H24N4O2/c1-13(2)25-12-17(11-24-25)15-7-19-18(5-4-6-22-19)20(8-15)27-14(3)16-9-21(26)23-10-16/h4-8,11-14,16H,9-10H2,1-3H3,(H,23,26)/t14-,16-/m1/s1
NCI pathway
Reactome pathway
US Patent
n/an/a>1.00E+4n/an/an/an/an/an/a
Boehringer Ingelheim International GmbH
US Patent
Assay Description
FLT3 is obtained from Invitrogen in 50 mM Tris (pH7.5); 100 mM NaCl; 0.05 mM EDTA, 0.05% NP-40, 2 mM DTT; 50% Glycerol # PV3182; Lot 286671; sequence...
US Patent US10947243 (2021)
SYK (aa 342-635)
(Homo sapiens (Human))
BDBM140390
(US10947243, Example 115 | US8912173, 115 | US99147...)
Show SMILES CC(C)n1cc(cn1)-c1cc(O[C@H](C)[C@H]2CNC(=O)C2)c2cccnc2c1 |r|
Show InChI InChI=1S/C21H24N4O2/c1-13(2)25-12-17(11-24-25)15-7-19-18(5-4-6-22-19)20(8-15)27-14(3)16-9-21(26)23-10-16/h4-8,11-14,16H,9-10H2,1-3H3,(H,23,26)/t14-,16-/m1/s1
US Patent
n/an/a 0.200n/an/an/an/an/an/a
Boehringer Ingelheim International GmbH
US Patent
Assay Description
Human GSK3beta (expressed and prified from SF21 cells) is obtained from the University Dundee/Scotland (Dr. James Hastie—Dept. of Biochemistry) in 50...
US Patent US10947243 (2021)
Aurora kinase B
(Homo sapiens (Human))
BDBM140390
(US10947243, Example 115 | US8912173, 115 | US99147...)
Show SMILES CC(C)n1cc(cn1)-c1cc(O[C@H](C)[C@H]2CNC(=O)C2)c2cccnc2c1 |r|
Show InChI InChI=1S/C21H24N4O2/c1-13(2)25-12-17(11-24-25)15-7-19-18(5-4-6-22-19)20(8-15)27-14(3)16-9-21(26)23-10-16/h4-8,11-14,16H,9-10H2,1-3H3,(H,23,26)/t14-,16-/m1/s1
Reactome pathway
US Patent
n/an/a 21n/an/an/an/an/an/a
Boehringer Ingelheim International GmbH
US Patent
Assay Description
Recombinant human Syk (amino acids 342-635) was expressed as a fusion protein with an N-terminal GST tag, affinity-purified and deep-frozen at a conc...
US Patent US10947243 (2021)
Receptor-type tyrosine-protein kinase FLT3
(Homo sapiens (Human))
BDBM140390
(US10947243, Example 115 | US8912173, 115 | US99147...)
Show SMILES CC(C)n1cc(cn1)-c1cc(O[C@H](C)[C@H]2CNC(=O)C2)c2cccnc2c1 |r|
Show InChI InChI=1S/C21H24N4O2/c1-13(2)25-12-17(11-24-25)15-7-19-18(5-4-6-22-19)20(8-15)27-14(3)16-9-21(26)23-10-16/h4-8,11-14,16H,9-10H2,1-3H3,(H,23,26)/t14-,16-/m1/s1
US Patent
n/an/a 41n/an/an/an/an/an/a
Boehringer Ingelheim International GmbH
US Patent
Assay Description
Recombinant human Aurora B (amino acids 1-344, clone number DU1773, Molecular weight 40.2 kDa, University of Dundee) was expressed as a fusion protei...
US Patent US10947243 (2021)
Glycogen synthase kinase-3 beta
(Homo sapiens (Human))
BDBM140390
(US10947243, Example 115 | US8912173, 115 | US99147...)
Show SMILES CC(C)n1cc(cn1)-c1cc(O[C@H](C)[C@H]2CNC(=O)C2)c2cccnc2c1 |r|
Show InChI InChI=1S/C21H24N4O2/c1-13(2)25-12-17(11-24-25)15-7-19-18(5-4-6-22-19)20(8-15)27-14(3)16-9-21(26)23-10-16/h4-8,11-14,16H,9-10H2,1-3H3,(H,23,26)/t14-,16-/m1/s1
NCI pathway
Reactome pathway
US Patent
n/an/a>1.00E+4n/an/an/an/an/an/a
University of Namur
Assay Description
Human GSK3beta (expressed and prified from SF21 cells) is obtained from the University Dundee/Scotland (Dr. James Hastie—Dept. of Biochemistry) ...
J Med Chem 51: 3077-80 (2008)
BindingDB Entry DOI: 10.7270/Q21G0PJ6