BDBM14040 Aminofurazanyl-azabenzimidazole 6g::N-(3-{[2-(4-amino-1,2,5-oxadiazol-3-yl)-1-ethyl-1H-imidazo[4,5-c]pyridin-6-yl]oxy}phenyl)benzamide
SMILES: CCn1c(nc2cnc(Oc3cccc(NC(=O)c4ccccc4)c3)cc12)-c1nonc1N
InChI Key: InChIKey=FQFROAXLLJKTJG-UHFFFAOYSA-N
Data: 1 IC50
Activity Spreadsheet -- Enzyme Inhibition Constant Data from BindingDB
Found 1 hit for monomerid = 14040
Trg + Lig
Ki
nM
ΔG°
kcal/mole
IC50
nM
Kd
nM
EC50/IC50
nM
koff
s-1
kon
M-1s-1
pHTemp
°C
Rho-associated protein kinase 1
(Homo sapiens (Human))
BDBM14040
(Aminofurazanyl-azabenzimidazole 6g | N-(3-{[2-(4-a...)
Show SMILES CCn1c(nc2cnc(Oc3cccc(NC(=O)c4ccccc4)c3)cc12)-c1nonc1N
Show InChI InChI=1S/C23H19N7O3/c1-2-30-18-12-19(25-13-17(18)27-22(30)20-21(24)29-33-28-20)32-16-10-6-9-15(11-16)26-23(31)14-7-4-3-5-8-14/h3-13H,2H2,1H3,(H2,24,29)(H,26,31)
NCI pathway
Reactome pathway
n/an/a 4n/an/an/an/a7.422
GlaxoSmithKline
Assay Description
The assay of Rock-1 activity involved incubation with peptide substrate and ATP/[gamma-33P] ATP, the subsequent incorporation of 33P into the peptid...
J Med Chem 50: 2-5 (2007)
Article DOI: 10.1021/jm060873p
BindingDB Entry DOI: 10.7270/Q2F18WZB