null
SMILES: CC1=C(C(CC(=O)N1)c1ccc(cc1)C(F)(F)F)C(=O)Nc1ccc2[nH]ncc2c1
InChI Key: InChIKey=PDSGDBHQLRAVID-UHFFFAOYSA-N
Activity Spreadsheet -- Enzyme Inhibition Constant Data from BindingDB
Found 1 hit for monomerid = 14050
Trg + Lig
Ki
nM
ΔG°
kcal/mole
IC50
nM
Kd
nM
EC50/IC50
nM
koff
s-1
kon
M-1s-1
pHTemp
°C
Rho-associated protein kinase 1
(Homo sapiens (Human))
BDBM14050
(N-(1H-indazol-5-yl)-2-methyl-6-oxo-4-[4-(trifluoro...)
Show SMILES CC1=C(C(CC(=O)N1)c1ccc(cc1)C(F)(F)F)C(=O)Nc1ccc2[nH]ncc2c1 |t:1|
Show InChI InChI=1S/C21H17F3N4O2/c1-11-19(20(30)27-15-6-7-17-13(8-15)10-25-28-17)16(9-18(29)26-11)12-2-4-14(5-3-12)21(22,23)24/h2-8,10,16H,9H2,1H3,(H,25,28)(H,26,29)(H,27,30)
NCI pathway
Reactome pathway
n/an/a 5n/an/an/an/a7.422
GlaxoSmithKline
Assay Description
The assay of Rock-1 activity involved incubation with peptide substrate and ATP/[gamma-33P] ATP, the subsequent incorporation of 33P into the peptid...
J Med Chem 50: 6-9 (2007)
Article DOI: 10.1021/jm0609014
BindingDB Entry DOI: 10.7270/Q298858V