null
SMILES: Cc1n[nH]c2ccc(NC(=O)C3=C(C)NC(=O)CC3c3ccc(cc3)C(F)(F)F)cc12
InChI Key: InChIKey=HKWUUOHQLQALHL-UHFFFAOYSA-N
Activity Spreadsheet -- Enzyme Inhibition Constant Data from BindingDB
Found 1 hit for monomerid = 14053
Trg + Lig
Ki
nM
ΔG°
kcal/mole
IC50
nM
Kd
nM
EC50/IC50
nM
koff
s-1
kon
M-1s-1
pHTemp
°C
Rho-associated protein kinase 1
(Homo sapiens (Human))
BDBM14053
(2-methyl-N-(3-methyl-1H-indazol-5-yl)-6-oxo-4-[4-(...)
Show SMILES Cc1n[nH]c2ccc(NC(=O)C3=C(C)NC(=O)CC3c3ccc(cc3)C(F)(F)F)cc12 |c:11|
Show InChI InChI=1S/C22H19F3N4O2/c1-11-16-9-15(7-8-18(16)29-28-11)27-21(31)20-12(2)26-19(30)10-17(20)13-3-5-14(6-4-13)22(23,24)25/h3-9,17H,10H2,1-2H3,(H,26,30)(H,27,31)(H,28,29)
NCI pathway
Reactome pathway
n/an/a 9n/an/an/an/a7.422
GlaxoSmithKline
Assay Description
The assay of Rock-1 activity involved incubation with peptide substrate and ATP/[gamma-33P] ATP, the subsequent incorporation of 33P into the peptid...
J Med Chem 50: 6-9 (2007)
Article DOI: 10.1021/jm0609014
BindingDB Entry DOI: 10.7270/Q298858V