BDBM140537 US8912221, 10
SMILES: C[C@@H](NC(=O)C1(COC1)NC(=O)c1ccno1)c1ncc(cc1F)-c1cc(Cl)cc(Cl)c1OCC(F)F
InChI Key: InChIKey=QRJFVILHVIPGKL-LLVKDONJSA-N
Data: 1 KI
Activity Spreadsheet -- Enzyme Inhibition Constant Data from BindingDB
Found 1 hit for monomerid = 140537
Trg + Lig
Ki
nM
ΔG°
kcal/mole
IC50
nM
Kd
nM
EC50/IC50
nM
koff
s-1
kon
M-1s-1
pHTemp
°C
Bradykinin B1 receptor
(Homo sapiens (Human))
BDBM140537
(US8912221, 10)
Show SMILES C[C@@H](NC(=O)C1(COC1)NC(=O)c1ccno1)c1ncc(cc1F)-c1cc(Cl)cc(Cl)c1OCC(F)F |r|
Show InChI InChI=1S/C23H19Cl2F3N4O5/c1-11(31-22(34)23(9-35-10-23)32-21(33)17-2-3-30-37-17)19-16(26)4-12(7-29-19)14-5-13(24)6-15(25)20(14)36-8-18(27)28/h2-7,11,18H,8-10H2,1H3,(H,31,34)(H,32,33)/t11-/m1/s1
US Patent
4.70n/an/an/an/an/an/a7.4n/a
Hoffmann-La Roche Inc.
US Patent
Assay Description
For binding, Bradykinin-1 receptor antagonist compounds were added in various concentrations in 50 mM Tris pH 7.4, 5 mM MgCl2 together with 6 nM Kall...
US Patent US8912221 (2014)
BindingDB Entry DOI: 10.7270/Q2668BWC