null
SMILES: CC1=C(C(CC(=O)N1)c1ccc(cc1)C(F)(F)F)C(=O)Nc1ccc2[nH]ncc2c1F
InChI Key: InChIKey=JOZIUFZJCBEIGY-UHFFFAOYSA-N
Activity Spreadsheet -- Enzyme Inhibition Constant Data from BindingDB
Found 1 hit for monomerid = 14054
Trg + Lig
Ki
nM
ΔG°
kcal/mole
IC50
nM
Kd
nM
EC50/IC50
nM
koff
s-1
kon
M-1s-1
pHTemp
°C
Rho-associated protein kinase 1
(Homo sapiens (Human))
BDBM14054
(N-(4-fluoro-1H-indazol-5-yl)-2-methyl-6-oxo-4-[4-(...)
Show SMILES CC1=C(C(CC(=O)N1)c1ccc(cc1)C(F)(F)F)C(=O)Nc1ccc2[nH]ncc2c1F |t:1|
Show InChI InChI=1S/C21H16F4N4O2/c1-10-18(20(31)28-16-7-6-15-14(19(16)22)9-26-29-15)13(8-17(30)27-10)11-2-4-12(5-3-11)21(23,24)25/h2-7,9,13H,8H2,1H3,(H,26,29)(H,27,30)(H,28,31)
NCI pathway
Reactome pathway
n/an/a 2.50E+3n/an/an/an/a7.422
GlaxoSmithKline
Assay Description
The assay of Rock-1 activity involved incubation with peptide substrate and ATP/[gamma-33P] ATP, the subsequent incorporation of 33P into the peptid...
J Med Chem 50: 6-9 (2007)
Article DOI: 10.1021/jm0609014
BindingDB Entry DOI: 10.7270/Q298858V