BDBM140558 US8912221, 31
SMILES: COc1ncc(cn1)C(=O)NC1(COC1)C(=O)N[C@H](C)c1ccc(cc1F)-c1cc(Cl)cc(F)c1-c1noc(C)n1
InChI Key: InChIKey=VISBFCYEAMWAIG-CYBMUJFWSA-N
Data: 1 KI
Activity Spreadsheet -- Enzyme Inhibition Constant Data from BindingDB
Found 1 hit for monomerid = 140558
Trg + Lig
Ki
nM
ΔG°
kcal/mole
IC50
nM
Kd
nM
EC50/IC50
nM
koff
s-1
kon
M-1s-1
pHTemp
°C
B1 bradykinin receptor
(Homo sapiens (Human))
BDBM140558
(US8912221, 31)
Show SMILES COc1ncc(cn1)C(=O)NC1(COC1)C(=O)N[C@H](C)c1ccc(cc1F)-c1cc(Cl)cc(F)c1-c1noc(C)n1 |r|
Show InChI InChI=1S/C27H23ClF2N6O5/c1-13(33-25(38)27(11-40-12-27)35-24(37)16-9-31-26(39-3)32-10-16)18-5-4-15(6-20(18)29)19-7-17(28)8-21(30)22(19)23-34-14(2)41-36-23/h4-10,13H,11-12H2,1-3H3,(H,33,38)(H,35,37)/t13-/m1/s1
US Patent
0.600n/an/an/an/an/an/a7.4n/a
Hoffmann-La Roche Inc.
US Patent
Assay Description
For binding, Bradykinin-1 receptor antagonist compounds were added in various concentrations in 50 mM Tris pH 7.4, 5 mM MgCl2 together with 6 nM Kall...
US Patent US8912221 (2014)
BindingDB Entry DOI: 10.7270/Q2668BWC