BDBM140564 US8912221, 37
SMILES: COc1cc(on1)C(=O)NC1(COC1)C(=O)N[C@H](C)c1ccc(cc1F)-c1cc(Cl)cc(Cl)c1OCC(F)F
InChI Key: InChIKey=LMQBUNABDATEJZ-GFCCVEGCSA-N
Data: 1 KI
Activity Spreadsheet -- Enzyme Inhibition Constant Data from BindingDB
Found 1 hit for monomerid = 140564
Trg + Lig
Ki
nM
ΔG°
kcal/mole
IC50
nM
Kd
nM
EC50/IC50
nM
koff
s-1
kon
M-1s-1
pHTemp
°C
Bradykinin B1 receptor
(Homo sapiens (Human))
BDBM140564
(US8912221, 37)
Show SMILES COc1cc(on1)C(=O)NC1(COC1)C(=O)N[C@H](C)c1ccc(cc1F)-c1cc(Cl)cc(Cl)c1OCC(F)F |r|
Show InChI InChI=1S/C25H22Cl2F3N3O6/c1-12(31-24(35)25(10-37-11-25)32-23(34)19-8-21(36-2)33-39-19)15-4-3-13(5-18(15)28)16-6-14(26)7-17(27)22(16)38-9-20(29)30/h3-8,12,20H,9-11H2,1-2H3,(H,31,35)(H,32,34)/t12-/m1/s1
US Patent
3.5n/an/an/an/an/an/a7.4n/a
Hoffmann-La Roche Inc.
US Patent
Assay Description
For binding, Bradykinin-1 receptor antagonist compounds were added in various concentrations in 50 mM Tris pH 7.4, 5 mM MgCl2 together with 6 nM Kall...
US Patent US8912221 (2014)
BindingDB Entry DOI: 10.7270/Q2668BWC