BDBM140570 US8912221, 43
SMILES: COc1cc(on1)C(=O)NC1(COC1)C(=O)N[C@H](C)c1ccc(cc1F)-c1cc(Cl)cc(F)c1-c1nnn(C)n1
InChI Key: InChIKey=DDBPJLLSDPDUAU-GFCCVEGCSA-N
Data: 1 KI
Activity Spreadsheet -- Enzyme Inhibition Constant Data from BindingDB
Found 1 hit for monomerid = 140570
Trg + Lig
Ki
nM
ΔG°
kcal/mole
IC50
nM
Kd
nM
EC50/IC50
nM
koff
s-1
kon
M-1s-1
pHTemp
°C
B1 bradykinin receptor
(Homo sapiens (Human))
BDBM140570
(US8912221, 43)
Show SMILES COc1cc(on1)C(=O)NC1(COC1)C(=O)N[C@H](C)c1ccc(cc1F)-c1cc(Cl)cc(F)c1-c1nnn(C)n1 |r|
Show InChI InChI=1S/C25H22ClF2N7O5/c1-12(29-24(37)25(10-39-11-25)30-23(36)19-9-20(38-3)33-40-19)15-5-4-13(6-17(15)27)16-7-14(26)8-18(28)21(16)22-31-34-35(2)32-22/h4-9,12H,10-11H2,1-3H3,(H,29,37)(H,30,36)/t12-/m1/s1
US Patent
1.40n/an/an/an/an/an/a7.4n/a
Hoffmann-La Roche Inc.
US Patent
Assay Description
For binding, Bradykinin-1 receptor antagonist compounds were added in various concentrations in 50 mM Tris pH 7.4, 5 mM MgCl2 together with 6 nM Kall...
US Patent US8912221 (2014)
BindingDB Entry DOI: 10.7270/Q2668BWC