BDBM140571 US8912221, 44
SMILES: COc1ncc(cn1)C(=O)NC1(COC1)C(=O)N[C@H](C)c1ccc(cc1F)-c1cc(Cl)cc(F)c1-c1nnn(C)n1
InChI Key: InChIKey=BQYDRNLLJKBIEI-CYBMUJFWSA-N
Data: 1 KI
Activity Spreadsheet -- Enzyme Inhibition Constant Data from BindingDB
Found 1 hit for monomerid = 140571
Trg + Lig
Ki
nM
ΔG°
kcal/mole
IC50
nM
Kd
nM
EC50/IC50
nM
koff
s-1
kon
M-1s-1
pHTemp
°C
B1 bradykinin receptor
(Homo sapiens (Human))
BDBM140571
(US8912221, 44)
Show SMILES COc1ncc(cn1)C(=O)NC1(COC1)C(=O)N[C@H](C)c1ccc(cc1F)-c1cc(Cl)cc(F)c1-c1nnn(C)n1 |r|
Show InChI InChI=1S/C26H23ClF2N8O4/c1-13(32-24(39)26(11-41-12-26)33-23(38)15-9-30-25(40-3)31-10-15)17-5-4-14(6-19(17)28)18-7-16(27)8-20(29)21(18)22-34-36-37(2)35-22/h4-10,13H,11-12H2,1-3H3,(H,32,39)(H,33,38)/t13-/m1/s1
US Patent
1.10n/an/an/an/an/an/a7.4n/a
Hoffmann-La Roche Inc.
US Patent
Assay Description
For binding, Bradykinin-1 receptor antagonist compounds were added in various concentrations in 50 mM Tris pH 7.4, 5 mM MgCl2 together with 6 nM Kall...
US Patent US8912221 (2014)
BindingDB Entry DOI: 10.7270/Q2668BWC